geronimo-scm mailing list archives

Site index · List index
Message view « Date » · « Thread »
Top « Date » · « Thread »
From continuum <contin...@stan.gbuild.org>
Subject [continuum] BUILD FAILURE: Java Mail
Date Mon, 27 Feb 2006 23:20:54 GMT
Online report : http://ci.gbuild.org/continuum/servlet/continuum/target/ProjectBuild.vm/view/ProjectBuild/id/57/buildId/795
Build statistics:
  State: Failed
  Previous State: Failed
  Started at: Mon, 27 Feb 2006 15:20:39 -0800
  Finished at: Mon, 27 Feb 2006 15:20:53 -0800
  Total time: 14s
  Build Trigger: Forced
  Exit code: 1
  Building machine hostname: stan.gbuild.org
  Operating system : Linux(unknown)
  Java version : 1.4.2_08(Sun Microsystems Inc.)

Changes
      No files changed
  
****************************************************************************
Output:
****************************************************************************
[INFO] Scanning for projects...
[INFO] ----------------------------------------------------------------------------
[INFO] Building Java Mail
[INFO]    task-segment: [clean, install]
[INFO] ----------------------------------------------------------------------------
[INFO] [clean:clean]
[INFO] Deleting directory /home/continuum/continuum-1.0.2/apps/continuum/work/57/target
[INFO] Deleting directory /home/continuum/continuum-1.0.2/apps/continuum/work/57/target/classes
[INFO] Deleting directory /home/continuum/continuum-1.0.2/apps/continuum/work/57/target/test-classes
[INFO] [resources:resources]
[INFO] Using default encoding to copy filtered resources.
[INFO] [compiler:compile]
Compiling 118 source files to /home/continuum/continuum-1.0.2/apps/continuum/work/57/target/classes
[INFO] [resources:testResources]
[INFO] Using default encoding to copy filtered resources.
[INFO] [compiler:testCompile]
Compiling 28 source files to /home/continuum/continuum-1.0.2/apps/continuum/work/57/target/test-classes
[INFO] [surefire:test]
[INFO] Setting reports dir: /home/continuum/continuum-1.0.2/apps/continuum/work/57/target/surefire-reports

-------------------------------------------------------
 T E S T S
-------------------------------------------------------
[surefire] Running javax.mail.FlagsTest
[surefire] Tests run: 8, Failures: 0, Errors: 0, Time elapsed: 0.029 sec
[surefire] Running javax.mail.MessagingExceptionTest
[surefire] Tests run: 5, Failures: 0, Errors: 0, Time elapsed: 0.006 sec
[surefire] Running javax.mail.PasswordAuthenticationTest
[surefire] Tests run: 2, Failures: 0, Errors: 0, Time elapsed: 0.002 sec
[surefire] Running javax.mail.MessageContextTest
[surefire] Tests run: 1, Failures: 0, Errors: 0, Time elapsed: 0.001 sec
Get header returned [Ljava.lang.String;@ea5461
Get all recipients returns 3
Received address geronimo-dev of type news
[surefire] Running javax.mail.internet.MimeMessageTest
[surefire] Tests run: 8, Failures: 2, Errors: 0, Time elapsed: 0.148 sec <<<<<<<<
FAILURE !! 
[surefire] Running javax.mail.internet.InternetAddressTest
[surefire] Tests run: 17, Failures: 0, Errors: 0, Time elapsed: 0.04 sec
Doing error test with (Geronimo
Doing error test with ((Geronimo)
Doing error test with "Geronimo
Doing error test with "Geronimo\
[surefire] Running javax.mail.internet.HeaderTokenizerTest
[surefire] Tests run: 4, Failures: 0, Errors: 0, Time elapsed: 0.004 sec
[surefire] Running javax.mail.internet.NewsAddressTest
[surefire] Tests run: 1, Failures: 0, Errors: 0, Time elapsed: 0.001 sec
[surefire] Running javax.mail.internet.ParameterListTest
[surefire] Tests run: 2, Failures: 0, Errors: 0, Time elapsed: 0.002 sec
[surefire] Running javax.mail.internet.ContentDispositionTest
[surefire] Tests run: 1, Failures: 0, Errors: 0, Time elapsed: 0.002 sec
[surefire] Running javax.mail.internet.InternetHeadersTest
[surefire] Tests run: 1, Failures: 0, Errors: 0, Time elapsed: 0.003 sec
------=_Part_1.1141082453597
foo:bar

Hello World
------=_Part_1.1141082453597

Hello Again
------=_Part_1.1141082453597--
[surefire] Running javax.mail.internet.MimeMultipartTest
[surefire] Tests run: 1, Failures: 0, Errors: 0, Time elapsed: 0.004 sec
Type string value is text/plain
[surefire] Running javax.mail.internet.ContentTypeTest
[surefire] Tests run: 15, Failures: 0, Errors: 0, Time elapsed: 0.016 sec
[surefire] Running javax.mail.internet.MailDateFormatTest
[surefire] Tests run: 1, Failures: 0, Errors: 0, Time elapsed: 0.004 sec
[surefire] Running javax.mail.event.MessageCountEventTest
[surefire] Tests run: 1, Failures: 0, Errors: 0, Time elapsed: 0.011 sec
[surefire] Running javax.mail.event.FolderEventTest
[surefire] Tests run: 1, Failures: 0, Errors: 0, Time elapsed: 0.006 sec
[surefire] Running javax.mail.event.StoreEventTest
[surefire] Tests run: 1, Failures: 0, Errors: 0, Time elapsed: 0.003 sec
[surefire] Running javax.mail.event.TransportEventTest
[surefire] Tests run: 1, Failures: 0, Errors: 0, Time elapsed: 0.01 sec
[surefire] Running javax.mail.event.MessageChangedEventTest
[surefire] Tests run: 1, Failures: 0, Errors: 0, Time elapsed: 0.003 sec
[surefire] Running javax.mail.event.ConnectionEventTest
[surefire] Tests run: 1, Failures: 0, Errors: 0, Time elapsed: 0.003 sec
[surefire] Running javax.mail.URLNameTest
[surefire] Tests run: 7, Failures: 0, Errors: 0, Time elapsed: 0.156 sec
[surefire] Running javax.mail.HeaderTest
[surefire] Tests run: 1, Failures: 0, Errors: 0, Time elapsed: 0.001 sec

Results :
[surefire] Tests run: 81, Failures: 2, Errors: 0

[INFO] ----------------------------------------------------------------------------
[ERROR] BUILD ERROR
[INFO] ----------------------------------------------------------------------------
[INFO] There are some test failure.
[INFO] ----------------------------------------------------------------------------
[INFO] For more information, run Maven with the -e switch
[INFO] ----------------------------------------------------------------------------
[INFO] Total time: 13 seconds
[INFO] Finished at: Mon Feb 27 15:20:53 PST 2006
[INFO] Final Memory: 4M/18M
[INFO] ----------------------------------------------------------------------------

****************************************************************************



Mime
View raw message