geronimo-scm mailing list archives

Site index · List index
Message view « Date » · « Thread »
Top « Date » · « Thread »
From continuum <contin...@stan.gbuild.org>
Subject [continuum] BUILD FAILURE: GBuild Agent
Date Fri, 13 Jan 2006 05:57:32 GMT
Online report : http://ci.gbuild.org/continuum/target/ProjectBuild.vm/view/ProjectBuild/id/17/buildId/754
Build statistics:
  State: Failed
  Previous State: Failed
  Started at: Thu, 12 Jan 2006 21:57:15 -0800
  Finished at: Thu, 12 Jan 2006 21:57:31 -0800
  Total time: 16s
  Build Trigger: Forced
  Exit code: 1
  Building machine hostname: stan.gbuild.org
  Operating system : Linux(unknown)
  Java version : 1.4.2_08(Sun Microsystems Inc.)

Changes
      No files changed
  
****************************************************************************
Output:
****************************************************************************
[INFO] Scanning for projects...
[INFO] ----------------------------------------------------------------------------
[INFO] Building GBuild Agent
[INFO]    task-segment: [clean, install]
[INFO] ----------------------------------------------------------------------------
[INFO] [clean:clean]
[INFO] Deleting directory /home/continuum/build/work/17/target
[INFO] [plexus:descriptor {execution: default}]
[INFO] [resources:resources]
[INFO] Using default encoding to copy filtered resources.
[WARNING] 
	Artifact junit:junit:jar:3.8.1 retains local scope 'test' overriding broader scope 'compile'
	given by a dependency. If this is not intended, modify or remove the local scope.

[WARNING] 
  This artifact has been relocated to org.springframework:spring:1.2.2.


[WARNING] 
  This artifact has been relocated to xml-apis:xml-apis:1.0.b2.


[WARNING] 
  This artifact has been relocated to xml-apis:xml-apis:1.0.b2.


[WARNING] 
  This artifact has been relocated to xml-apis:xml-apis:1.0.b2.


[WARNING] 
  This artifact has been relocated to xml-apis:xml-apis:1.0.b2.


[WARNING] 
  This artifact has been relocated to javax.jdo:jdo:2.0-20050809.1515.


[INFO] [compiler:compile]
Compiling 36 source files to /home/continuum/build/work/17/target/classes
[INFO] [resources:testResources]
[INFO] Using default encoding to copy filtered resources.
[WARNING] 
  This artifact has been relocated to org.springframework:spring:1.2.2.


[WARNING] 
  This artifact has been relocated to xml-apis:xml-apis:1.0.b2.


[WARNING] 
  This artifact has been relocated to xml-apis:xml-apis:1.0.b2.


[WARNING] 
  This artifact has been relocated to xml-apis:xml-apis:1.0.b2.


[WARNING] 
  This artifact has been relocated to xml-apis:xml-apis:1.0.b2.


[WARNING] 
  This artifact has been relocated to javax.jdo:jdo:2.0-20050809.1515.


[INFO] [compiler:testCompile]
Compiling 9 source files to /home/continuum/build/work/17/target/test-classes
[WARNING] 
  This artifact has been relocated to org.springframework:spring:1.2.2.


[WARNING] 
  This artifact has been relocated to xml-apis:xml-apis:1.0.b2.


[WARNING] 
  This artifact has been relocated to xml-apis:xml-apis:1.0.b2.


[WARNING] 
  This artifact has been relocated to xml-apis:xml-apis:1.0.b2.


[WARNING] 
  This artifact has been relocated to xml-apis:xml-apis:1.0.b2.


[WARNING] 
  This artifact has been relocated to javax.jdo:jdo:2.0-20050809.1515.


[INFO] [surefire:test]
[INFO] Setting reports dir: /home/continuum/build/work/17/target/surefire-reports

-------------------------------------------------------
 T E S T S
-------------------------------------------------------
Jan 12, 2006 9:57:24 PM org.activemq.broker.impl.BrokerContainerImpl start
INFO: ActiveMQ 3.2 JMS Message Broker (ID:stan.gbuild.org-33635-1137131844656-0:0) is starting
Jan 12, 2006 9:57:24 PM org.activemq.broker.impl.BrokerContainerImpl start
INFO: For help or more information please see: http://www.logicblaze.com
Jan 12, 2006 9:57:25 PM org.activemq.broker.impl.DefaultBroker tryCreatePersistenceAdapter
INFO: Persistence adapter created using: org.activemq.broker.impl.DefaultPersistenceAdapterFactory
Jan 12, 2006 9:57:27 PM org.activemq.store.jdbc.JDBCPersistenceAdapter start
INFO: Database driver recognized: [apache_derby_embedded_jdbc_driver]
Jan 12, 2006 9:57:27 PM org.activemq.store.journal.JournalPersistenceAdapter start
INFO: Opening journal.
Jan 12, 2006 9:57:27 PM org.activemq.store.journal.JournalPersistenceAdapter start
INFO: Opened journal: Active Journal: using 2 x 20.0 Megs at: ActiveMQ/ID_stan.gbuild.org-33635-1137131844656-0_0/journal
Jan 12, 2006 9:57:27 PM org.activemq.store.journal.JournalPersistenceAdapter recover
INFO: Journal Recovery Started.
Jan 12, 2006 9:57:27 PM org.activemq.store.journal.JournalPersistenceAdapter recover
INFO: Journal Recovered: 0 message(s) in transactions recovered.
Jan 12, 2006 9:57:28 PM org.activemq.transport.tcp.TcpTransportServerChannel start
INFO: Listening for connections at: tcp://stan.gbuild.org:61616
Jan 12, 2006 9:57:28 PM org.activemq.broker.impl.BrokerConnectorImpl start
INFO: ActiveMQ connector started: TcpTransportServerChannel@tcp://stan.gbuild.org:61616
Jan 12, 2006 9:57:28 PM org.activemq.broker.impl.BrokerContainerImpl start
INFO: ActiveMQ JMS Message Broker (ID:stan.gbuild.org-33635-1137131844656-0:0) has started
Jan 12, 2006 9:57:28 PM org.activemq.ActiveMQConnection statusChanged
INFO: channel status changed: Channel: TcpTransportChannel: Socket[addr=localhost/127.0.0.1,port=61616,localport=44951]
has connected
Jan 12, 2006 9:57:28 PM org.activemq.broker.impl.BrokerContainerImpl registerConnection
INFO: Adding new client: ID:stan.gbuild.org-33635-1137131844656-4:0 on transport: TcpTransportChannel:
Socket[addr=/127.0.0.1,port=44951,localport=61616]
[INFO] Client connected: tcp://localhost:61616
[INFO] Continuum Build Agent starting.
[INFO] Continuum Build Agent started and waiting for work.
[INFO] Updating project: id: '10', name 'Shell Project'.
[INFO] Executing: cvs -f -q update -d
[INFO] Working directory: /home/continuum/build/work/17/agent/work/10
[WARNING] Could not find the executable 'ant' in the path '[]'.
[WARNING] Could not find the executable 'maven' in the path '[]'.
[WARNING] Could not find the executable 'mvn' in the path '[]'.
[INFO] Build executors:
[INFO]   maven-1
[INFO]   ant
[INFO]   maven2
[INFO]   shell
[INFO] Updating project 'Shell Project' from checkout.
[WARNING] Executable '/home/continuum/build/work/17/target/it/shell/script.sh'.
[INFO] Arguments: 
[INFO] Working directory: /home/continuum/build/work/17/agent/work/10
[INFO] Exit code: 0
Jan 12, 2006 9:57:29 PM org.activemq.broker.impl.BrokerContainerImpl deregisterConnection
INFO: Removing client: ID:stan.gbuild.org-33635-1137131844656-4:0 on transport: TcpTransportChannel:
Socket[addr=/127.0.0.1,port=44951,localport=61616]
Jan 12, 2006 9:57:29 PM org.activemq.broker.impl.BrokerContainerImpl stop
INFO: ActiveMQ Message Broker (ID:stan.gbuild.org-33635-1137131844656-0:0) is shutting down
Jan 12, 2006 9:57:29 PM org.activemq.broker.impl.BrokerConnectorImpl stop
INFO: ActiveMQ connector stopped: TcpTransportServerChannel@tcp://stan.gbuild.org:61616
Jan 12, 2006 9:57:29 PM org.activemq.broker.impl.BrokerContainerImpl stop
INFO: ActiveMQ JMS Message Broker (ID:stan.gbuild.org-33635-1137131844656-0:0) stopped
Jan 12, 2006 9:57:29 PM org.activemq.broker.impl.BrokerContainerImpl start
INFO: ActiveMQ 3.2 JMS Message Broker (ID:stan.gbuild.org-33635-1137131844656-13:0) is starting
Jan 12, 2006 9:57:29 PM org.activemq.broker.impl.BrokerContainerImpl start
INFO: For help or more information please see: http://www.logicblaze.com
Jan 12, 2006 9:57:29 PM org.activemq.broker.impl.DefaultBroker tryCreatePersistenceAdapter
INFO: Persistence adapter created using: org.activemq.broker.impl.DefaultPersistenceAdapterFactory
Jan 12, 2006 9:57:29 PM org.activemq.store.jdbc.JDBCPersistenceAdapter start
INFO: Database driver recognized: [apache_derby_embedded_jdbc_driver]
Jan 12, 2006 9:57:29 PM org.activemq.store.jdbc.adapter.DefaultJDBCAdapter doCreateTables
INFO: Could not create JDBC tables; they could already exist. Failure was: CREATE TABLE ACTIVEMQ_MSGS(ID
INTEGER NOT NULL, CONTAINER VARCHAR(250), MSGID VARCHAR(250), MSG BLOB, PRIMARY KEY ( ID )
) Message: Table/View 'ACTIVEMQ_MSGS' already exists in Schema 'APP'. SQLState: X0Y32 Vendor
code: 20000
Jan 12, 2006 9:57:29 PM org.activemq.store.jdbc.adapter.DefaultJDBCAdapter doCreateTables
INFO: Could not create JDBC tables; they could already exist. Failure was: CREATE TABLE ACTIVEMQ_TXS(XID
VARCHAR(250) NOT NULL, PRIMARY KEY ( XID )) Message: Table/View 'ACTIVEMQ_TXS' already exists
in Schema 'APP'. SQLState: X0Y32 Vendor code: 20000
Jan 12, 2006 9:57:29 PM org.activemq.store.jdbc.adapter.DefaultJDBCAdapter doCreateTables
INFO: Could not create JDBC tables; they could already exist. Failure was: CREATE TABLE ACTIVEMQ_ACKS(SUB
VARCHAR(250) NOT NULL, CONTAINER VARCHAR(250) NOT NULL, LAST_ACKED_ID INTEGER, SE_ID INTEGER,
SE_CLIENT_ID VARCHAR(250), SE_CONSUMER_NAME VARCHAR(250), SE_SELECTOR VARCHAR(250), PRIMARY
KEY ( SUB, CONTAINER )) Message: Table/View 'ACTIVEMQ_ACKS' already exists in Schema 'APP'.
SQLState: X0Y32 Vendor code: 20000
Jan 12, 2006 9:57:29 PM org.activemq.store.jdbc.adapter.DefaultJDBCAdapter doCreateTables
INFO: Could not create JDBC tables; they could already exist. Failure was: ALTER TABLE ACTIVEMQ_MSGS
ADD EXPIRATION BIGINT Message: Column 'EXPIRATION' already exists in Table/View 'APP.ACTIVEMQ_MSGS'.
SQLState: X0Y32 Vendor code: 20000
Jan 12, 2006 9:57:29 PM org.activemq.store.jdbc.adapter.DefaultJDBCAdapter doCreateTables
INFO: Could not create JDBC tables; they could already exist. Failure was: ALTER TABLE ACTIVEMQ_MSGS
ADD SENT_TO_DEADLETTER CHAR(1) Message: Column 'SENT_TO_DEADLETTER' already exists in Table/View
'APP.ACTIVEMQ_MSGS'. SQLState: X0Y32 Vendor code: 20000
Jan 12, 2006 9:57:29 PM org.activemq.store.journal.JournalPersistenceAdapter start
INFO: Opening journal.
Jan 12, 2006 9:57:29 PM org.activemq.store.journal.JournalPersistenceAdapter start
INFO: Opened journal: Active Journal: using 2 x 20.0 Megs at: ActiveMQ/ID_stan.gbuild.org-33635-1137131844656-13_0/journal
Jan 12, 2006 9:57:29 PM org.activemq.store.journal.JournalPersistenceAdapter recover
INFO: Journal Recovery Started.
Jan 12, 2006 9:57:29 PM org.activemq.store.journal.JournalPersistenceAdapter recover
INFO: Journal Recovered: 0 message(s) in transactions recovered.
Jan 12, 2006 9:57:29 PM org.activemq.transport.tcp.TcpTransportServerChannel start
INFO: Listening for connections at: tcp://stan.gbuild.org:61616
Jan 12, 2006 9:57:29 PM org.activemq.broker.impl.BrokerConnectorImpl start
INFO: ActiveMQ connector started: TcpTransportServerChannel@tcp://stan.gbuild.org:61616
Jan 12, 2006 9:57:29 PM org.activemq.broker.impl.BrokerContainerImpl start
INFO: ActiveMQ JMS Message Broker (ID:stan.gbuild.org-33635-1137131844656-13:0) has started
Jan 12, 2006 9:57:29 PM org.activemq.ActiveMQConnection statusChanged
INFO: channel status changed: Channel: TcpTransportChannel: Socket[addr=localhost/127.0.0.1,port=61616,localport=44952]
has connected
Jan 12, 2006 9:57:29 PM org.activemq.broker.impl.BrokerContainerImpl registerConnection
INFO: Adding new client: ID:stan.gbuild.org-33635-1137131844656-17:0 on transport: TcpTransportChannel:
Socket[addr=/127.0.0.1,port=44952,localport=61616]
Jan 12, 2006 9:57:29 PM org.activemq.ActiveMQConnection statusChanged
INFO: channel status changed: Channel: TcpTransportChannel: Socket[addr=localhost/127.0.0.1,port=61616,localport=44953]
has connected
Jan 12, 2006 9:57:29 PM org.activemq.broker.impl.BrokerContainerImpl registerConnection
INFO: Adding new client: ID:stan.gbuild.org-33635-1137131844656-26:0 on transport: TcpTransportChannel:
Socket[addr=/127.0.0.1,port=44953,localport=61616]
[INFO] Client connected: tcp://localhost:61616
[INFO] Continuum Build Agent starting.
[INFO] Continuum Build Agent starting.
[INFO] Continuum Build Agent started and waiting for work.
[INFO] Continuum Build Agent started and waiting for work.
[INFO] Message Received ID:stan.gbuild.org-33635-1137131844656-24:0 on ID:stan.gbuild.org-33635-1137131844656-26:0:BUILD.TASKS
[INFO] Executing extention clean-dead-processes pre process
[INFO] Executing extention general-headers pre process
[INFO] Executing extention report-activity pre process
[INFO] Executing extention build-output pre process
[INFO] Executing extention file-include pre process
[INFO] Updating project: id: '12', name 'Shell Project'.
[INFO] Executing: cvs -f -q update -d
[INFO] Working directory: /home/continuum/build/work/17/agent/work/12
[WARNING] Could not find the executable 'ant' in the path '[]'.
[WARNING] Could not find the executable 'maven' in the path '[]'.
[WARNING] Could not find the executable 'mvn' in the path '[]'.
[INFO] Build executors:
[INFO]   maven-1
[INFO]   ant
[INFO]   maven2
[INFO]   shell
[INFO] Updating project 'Shell Project' from checkout.
[WARNING] Executable '/home/continuum/build/work/17/target/it/shell/script.sh'.
[INFO] Arguments: one
[INFO] Working directory: /home/continuum/build/work/17/agent/work/12
[INFO] Exit code: 0
[INFO] Executing extention clean-dead-processes post process
[INFO] Executing extention general-headers post process
[WARNING] replaced projectId = 12
[WARNING] replaced buildDefinitionId = 0
[INFO] Executing extention report-activity post process
[INFO] Executing extention build-output post process
[INFO] Including 24 - /home/continuum/build/work/17/agent/output/12/0.log.txt
[INFO] Executing extention file-include post process
[INFO] Finished processing ID:stan.gbuild.org-33635-1137131844656-24:0
[INFO] Results sent to BUILD.RESULTS
[INFO] Message Received ID:stan.gbuild.org-33635-1137131844656-24:1 on ID:stan.gbuild.org-33635-1137131844656-26:0:BUILD.TASKS
[INFO] Executing extention clean-dead-processes pre process
[INFO] Executing extention general-headers pre process
[INFO] Executing extention report-activity pre process
[INFO] Executing extention build-output pre process
[INFO] Executing extention file-include pre process
[INFO] Updating project: id: '12', name 'Shell Project'.
[INFO] Executing: cvs -f -q update -d
[INFO] Working directory: /home/continuum/build/work/17/agent/work/12
[INFO] Updating project 'Shell Project' from checkout.
[WARNING] Executable '/home/continuum/build/work/17/target/it/shell/script.sh'.
[INFO] Arguments: two
[INFO] Working directory: /home/continuum/build/work/17/agent/work/12
[INFO] Exit code: 0
[INFO] Executing extention clean-dead-processes post process
[INFO] Executing extention general-headers post process
[WARNING] replaced projectId = 12
[WARNING] replaced buildDefinitionId = 1
[INFO] Executing extention report-activity post process
[INFO] Executing extention build-output post process
[INFO] Including 24 - /home/continuum/build/work/17/agent/output/12/0.log.txt
[INFO] Executing extention file-include post process
[INFO] Finished processing ID:stan.gbuild.org-33635-1137131844656-24:1
[INFO] Results sent to BUILD.RESULTS
[INFO] Message Received ID:stan.gbuild.org-33635-1137131844656-24:2 on ID:stan.gbuild.org-33635-1137131844656-26:0:BUILD.TASKS
[INFO] Message Received ID:stan.gbuild.org-33635-1137131844656-24:3 on ID:stan.gbuild.org-33635-1137131844656-26:0:BUILD.TASKS
[INFO] Executing extention clean-dead-processes pre process
[INFO] Executing extention general-headers pre process
[INFO] Executing extention report-activity pre process
[INFO] Executing extention build-output pre process
[INFO] Executing extention file-include pre process
[INFO] Updating project: id: '12', name 'Shell Project'.
[INFO] Executing: cvs -f -q update -d
[INFO] Working directory: /home/continuum/build/work/17/agent/work/12
[INFO] Executing extention clean-dead-processes pre process
[INFO] Executing extention general-headers pre process
[INFO] Executing extention report-activity pre process
[RESULT] Shell Project : one : 1
[INFO] Updating project 'Shell Project' from checkout.
[WARNING] Executable '/home/continuum/build/work/17/target/it/shell/script.sh'.
[INFO] Arguments: four
[INFO] Working directory: /home/continuum/build/work/17/agent/work/12
[INFO] Executing extention build-output pre process
[INFO] Executing extention file-include pre process
[INFO] Updating project: id: '12', name 'Shell Project'.
[INFO] Executing: cvs -f -q update -d
[INFO] Working directory: /home/continuum/build/work/17/agent/work/12
[RESULT] Shell Project : two : 1
[INFO] Exit code: 0
[INFO] Executing extention clean-dead-processes post process
[INFO] Updating project 'Shell Project' from checkout.
[WARNING] Executable '/home/continuum/build/work/17/target/it/shell/script.sh'.
[INFO] Arguments: three
[INFO] Working directory: /home/continuum/build/work/17/agent/work/12
[INFO] Exit code: 0
[INFO] Executing extention general-headers post process
[WARNING] replaced projectId = 12
[WARNING] replaced buildDefinitionId = 3
[INFO] Executing extention clean-dead-processes post process
[INFO] Executing extention report-activity post process
[INFO] Executing extention build-output post process
[INFO] Including 26 - /home/continuum/build/work/17/agent/output/12/0.log.txt
[INFO] Executing extention file-include post process
[INFO] Finished processing ID:stan.gbuild.org-33635-1137131844656-24:3
[INFO] Results sent to BUILD.RESULTS
[INFO] Message Received ID:stan.gbuild.org-33635-1137131844656-24:4 on ID:stan.gbuild.org-33635-1137131844656-26:0:BUILD.TASKS
[INFO] Executing extention clean-dead-processes pre process
[INFO] Executing extention general-headers pre process
[INFO] Executing extention report-activity pre process
[RESULT] Shell Project : four : 1
[INFO] Executing extention build-output pre process
[INFO] Executing extention file-include pre process
[INFO] Updating project: id: '12', name 'Shell Project'.
[INFO] Executing: cvs -f -q update -d
[INFO] Working directory: /home/continuum/build/work/17/agent/work/12
[INFO] Executing extention general-headers post process
[WARNING] replaced projectId = 12
[WARNING] replaced buildDefinitionId = 2
[INFO] Executing extention report-activity post process
[INFO] Executing extention build-output post process
[INFO] Including 26 - /home/continuum/build/work/17/agent/output/12/0.log.txt
[INFO] Executing extention file-include post process
[INFO] Updating project 'Shell Project' from checkout.
[INFO] Finished processing ID:stan.gbuild.org-33635-1137131844656-24:2
[WARNING] Executable '/home/continuum/build/work/17/target/it/shell/script.sh'.
[INFO] Arguments: five
[INFO] Working directory: /home/continuum/build/work/17/agent/work/12
[INFO] Results sent to BUILD.RESULTS
[RESULT] Shell Project : three : 1
[INFO] Exit code: 0
[INFO] Executing extention clean-dead-processes post process
[INFO] Executing extention general-headers post process
[WARNING] replaced projectId = 12
[WARNING] replaced buildDefinitionId = 4
[INFO] Executing extention report-activity post process
[INFO] Executing extention build-output post process
[INFO] Including 25 - /home/continuum/build/work/17/agent/output/12/0.log.txt
[INFO] Executing extention file-include post process
[INFO] Finished processing ID:stan.gbuild.org-33635-1137131844656-24:4
[INFO] Results sent to BUILD.RESULTS
[RESULT] Shell Project : five : 1
[INFO] Message Received ID:stan.gbuild.org-33635-1137131844656-24:5 on ID:stan.gbuild.org-33635-1137131844656-26:0:BUILD.TASKS
[INFO] Message Received ID:stan.gbuild.org-33635-1137131844656-24:6 on ID:stan.gbuild.org-33635-1137131844656-26:0:BUILD.TASKS
[INFO] Executing extention clean-dead-processes pre process
[INFO] Executing extention general-headers pre process
[INFO] Executing extention report-activity pre process
[INFO] Executing extention clean-dead-processes pre process
[INFO] Executing extention general-headers pre process
[INFO] Executing extention report-activity pre process
[INFO] Executing extention build-output pre process
[INFO] Executing extention file-include pre process
[INFO] Updating project: id: '12', name 'Shell Project'.
[INFO] Executing extention build-output pre process
[INFO] Executing extention file-include pre process
[INFO] Executing: cvs -f -q update -d
[INFO] Working directory: /home/continuum/build/work/17/agent/work/12
[INFO] Updating project: id: '12', name 'Shell Project'.
[INFO] Updating project 'Shell Project' from checkout.
[INFO] Executing: cvs -f -q update -d
[INFO] Working directory: /home/continuum/build/work/17/agent/work/12
[WARNING] Executable '/home/continuum/build/work/17/target/it/shell/script.sh'.
[INFO] Arguments: six
[INFO] Working directory: /home/continuum/build/work/17/agent/work/12
[INFO] Updating project 'Shell Project' from checkout.
[INFO] Exit code: 0
[WARNING] Executable '/home/continuum/build/work/17/target/it/shell/script.sh'.
[INFO] Arguments: seven
[INFO] Working directory: /home/continuum/build/work/17/agent/work/12
[INFO] Executing extention clean-dead-processes post process
[INFO] Exit code: 0
[INFO] Executing extention clean-dead-processes post process
[INFO] Executing extention general-headers post process
[WARNING] replaced projectId = 12
[WARNING] replaced buildDefinitionId = 5
[INFO] Executing extention report-activity post process
[INFO] Executing extention build-output post process
[INFO] Including 26 - /home/continuum/build/work/17/agent/output/12/0.log.txt
[INFO] Executing extention file-include post process
[INFO] Finished processing ID:stan.gbuild.org-33635-1137131844656-24:5
[INFO] Results sent to BUILD.RESULTS
[INFO] Message Received ID:stan.gbuild.org-33635-1137131844656-24:7 on ID:stan.gbuild.org-33635-1137131844656-26:0:BUILD.TASKS
[RESULT] Shell Project : six : 1
[INFO] Executing extention general-headers post process
[WARNING] replaced projectId = 12
[WARNING] replaced buildDefinitionId = 6
[INFO] Executing extention report-activity post process
[INFO] Executing extention clean-dead-processes pre process
[INFO] Executing extention general-headers pre process
[INFO] Executing extention report-activity pre process
[INFO] Executing extention build-output pre process
[INFO] Executing extention file-include pre process
[INFO] Executing extention build-output post process
[INFO] Updating project: id: '12', name 'Shell Project'.
[INFO] Executing: cvs -f -q update -d
[INFO] Working directory: /home/continuum/build/work/17/agent/work/12
[INFO] Including 26 - /home/continuum/build/work/17/agent/output/12/0.log.txt
[INFO] Executing extention file-include post process
[INFO] Finished processing ID:stan.gbuild.org-33635-1137131844656-24:6
[INFO] Results sent to BUILD.RESULTS
[INFO] Message Received ID:stan.gbuild.org-33635-1137131844656-24:8 on ID:stan.gbuild.org-33635-1137131844656-26:0:BUILD.TASKS
[RESULT] Shell Project : seven : 1
[INFO] Updating project 'Shell Project' from checkout.
[WARNING] Executable '/home/continuum/build/work/17/target/it/shell/script.sh'.
[INFO] Arguments: eight
[INFO] Working directory: /home/continuum/build/work/17/agent/work/12
[INFO] Executing extention clean-dead-processes pre process
[INFO] Executing extention general-headers pre process
[INFO] Executing extention report-activity pre process
[INFO] Executing extention build-output pre process
[INFO] Executing extention file-include pre process
[INFO] Updating project: id: '12', name 'Shell Project'.
[INFO] Executing: cvs -f -q update -d
[INFO] Working directory: /home/continuum/build/work/17/agent/work/12
[INFO] Exit code: 0
[INFO] Executing extention clean-dead-processes post process
[INFO] Updating project 'Shell Project' from checkout.
[WARNING] Executable '/home/continuum/build/work/17/target/it/shell/script.sh'.
[INFO] Arguments: nine
[INFO] Working directory: /home/continuum/build/work/17/agent/work/12
[INFO] Exit code: 0
[INFO] Executing extention clean-dead-processes post process
[INFO] Executing extention general-headers post process
[WARNING] replaced projectId = 12
[WARNING] replaced buildDefinitionId = 7
[INFO] Executing extention report-activity post process
[INFO] Executing extention build-output post process
[INFO] Including 25 - /home/continuum/build/work/17/agent/output/12/0.log.txt
[INFO] Executing extention file-include post process
[INFO] Finished processing ID:stan.gbuild.org-33635-1137131844656-24:7
[INFO] Results sent to BUILD.RESULTS
[RESULT] Shell Project : eight : 1
[INFO] Executing extention general-headers post process
[WARNING] replaced projectId = 12
[WARNING] replaced buildDefinitionId = 8
[INFO] Executing extention report-activity post process
[INFO] Executing extention build-output post process
[INFO] Including 25 - /home/continuum/build/work/17/agent/output/12/0.log.txt
[INFO] Executing extention file-include post process
[INFO] Finished processing ID:stan.gbuild.org-33635-1137131844656-24:8
[INFO] Results sent to BUILD.RESULTS
[RESULT] Shell Project : nine : 1
[INFO] Message Received ID:stan.gbuild.org-33635-1137131844656-24:9 on ID:stan.gbuild.org-33635-1137131844656-26:0:BUILD.TASKS
[INFO] Message Received ID:stan.gbuild.org-33635-1137131844656-24:10 on ID:stan.gbuild.org-33635-1137131844656-26:0:BUILD.TASKS
[INFO] Executing extention clean-dead-processes pre process
[INFO] Executing extention general-headers pre process
[INFO] Executing extention report-activity pre process
[INFO] Executing extention clean-dead-processes pre process
[INFO] Executing extention general-headers pre process
[INFO] Executing extention report-activity pre process
[INFO] Executing extention build-output pre process
[INFO] Executing extention file-include pre process
[INFO] Updating project: id: '12', name 'Shell Project'.
[INFO] Executing: cvs -f -q update -d
[INFO] Working directory: /home/continuum/build/work/17/agent/work/12
[INFO] Executing extention build-output pre process
[INFO] Executing extention file-include pre process
[INFO] Updating project: id: '12', name 'Shell Project'.
[INFO] Updating project 'Shell Project' from checkout.
[INFO] Executing: cvs -f -q update -d
[INFO] Working directory: /home/continuum/build/work/17/agent/work/12
[WARNING] Executable '/home/continuum/build/work/17/target/it/shell/script.sh'.
[INFO] Arguments: ten
[INFO] Working directory: /home/continuum/build/work/17/agent/work/12
[INFO] Updating project 'Shell Project' from checkout.
[INFO] Exit code: 0
[WARNING] Executable '/home/continuum/build/work/17/target/it/shell/script.sh'.
[INFO] Arguments: eleven
[INFO] Working directory: /home/continuum/build/work/17/agent/work/12
[INFO] Executing extention clean-dead-processes post process
[INFO] Exit code: 0
[INFO] Executing extention clean-dead-processes post process
[INFO] Executing extention general-headers post process
[WARNING] replaced projectId = 12
[WARNING] replaced buildDefinitionId = 9
[INFO] Executing extention report-activity post process
[INFO] Executing extention build-output post process
[INFO] Including 27 - /home/continuum/build/work/17/agent/output/12/0.log.txt
[INFO] Executing extention file-include post process
[INFO] Finished processing ID:stan.gbuild.org-33635-1137131844656-24:9
[INFO] Results sent to BUILD.RESULTS
[INFO] Message Received ID:stan.gbuild.org-33635-1137131844656-24:11 on ID:stan.gbuild.org-33635-1137131844656-26:0:BUILD.TASKS
[INFO] Executing extention general-headers post process
[WARNING] replaced projectId = 12
[WARNING] replaced buildDefinitionId = 10
[INFO] Executing extention report-activity post process
[RESULT] Shell Project : ten : 1
[INFO] Executing extention build-output post process
[INFO] Including 27 - /home/continuum/build/work/17/agent/output/12/0.log.txt
[INFO] Executing extention file-include post process
[INFO] Finished processing ID:stan.gbuild.org-33635-1137131844656-24:10
[INFO] Results sent to BUILD.RESULTS
[INFO] Executing extention clean-dead-processes pre process
[INFO] Executing extention general-headers pre process
[INFO] Executing extention report-activity pre process
[INFO] Executing extention build-output pre process
[INFO] Executing extention file-include pre process
[INFO] Updating project: id: '12', name 'Shell Project'.
[INFO] Executing: cvs -f -q update -d
[INFO] Working directory: /home/continuum/build/work/17/agent/work/12
[RESULT] Shell Project : eleven : 1
[INFO] Updating project 'Shell Project' from checkout.
[WARNING] Executable '/home/continuum/build/work/17/target/it/shell/script.sh'.
[INFO] Arguments: twelve
[INFO] Working directory: /home/continuum/build/work/17/agent/work/12
[INFO] Exit code: 0
[INFO] Executing extention clean-dead-processes post process
[INFO] Executing extention general-headers post process
[WARNING] replaced projectId = 12
[WARNING] replaced buildDefinitionId = 11
[INFO] Executing extention report-activity post process
[INFO] Executing extention build-output post process
[INFO] Including 27 - /home/continuum/build/work/17/agent/output/12/0.log.txt
[INFO] Executing extention file-include post process
[INFO] Finished processing ID:stan.gbuild.org-33635-1137131844656-24:11
[INFO] Results sent to BUILD.RESULTS
[RESULT] Shell Project : twelve : 1
Jan 12, 2006 9:57:31 PM org.activemq.broker.impl.BrokerContainerImpl deregisterConnection
INFO: Removing client: ID:stan.gbuild.org-33635-1137131844656-17:0 on transport: TcpTransportChannel:
Socket[addr=/127.0.0.1,port=44952,localport=61616]
Jan 12, 2006 9:57:31 PM org.activemq.broker.impl.BrokerContainerImpl stop
INFO: ActiveMQ Message Broker (ID:stan.gbuild.org-33635-1137131844656-13:0) is shutting down
Jan 12, 2006 9:57:31 PM org.activemq.broker.impl.BrokerContainerImpl deregisterConnection
INFO: Removing client: ID:stan.gbuild.org-33635-1137131844656-26:0 on transport: TcpTransportChannel:
Socket[addr=/127.0.0.1,port=44953,localport=61616]
Jan 12, 2006 9:57:31 PM org.activemq.transport.tcp.TcpTransportChannel doClose
WARNING: Peer closed connection
java.io.EOFException
	at java.io.DataInputStream.readByte(DataInputStream.java:333)
	at org.activemq.io.AbstractWireFormat.readPacket(AbstractWireFormat.java:230)
	at org.activemq.transport.tcp.TcpTransportChannel.run(TcpTransportChannel.java:313)
	at java.lang.Thread.run(Thread.java:534)
Jan 12, 2006 9:57:31 PM org.activemq.ActiveMQConnection statusChanged
INFO: channel status changed: Channel: TcpTransportChannel: Socket[addr=localhost/127.0.0.1,port=61616,localport=44953]
has disconnected
Jan 12, 2006 9:57:31 PM org.activemq.broker.impl.BrokerConnectorImpl stop
INFO: ActiveMQ connector stopped: TcpTransportServerChannel@tcp://stan.gbuild.org:61616
[INFO] JMSException 21067763
[FATAL ERROR] JMS Exception occured.  Attempting reconnect.
javax.jms.JMSException: Error reading socket: java.io.EOFException
	at org.activemq.util.JMSExceptionHelper.newJMSException(JMSExceptionHelper.java:49)
	at org.activemq.transport.tcp.TcpTransportChannel.doClose(TcpTransportChannel.java:509)
	at org.activemq.transport.tcp.TcpTransportChannel.run(TcpTransportChannel.java:330)
	at java.lang.Thread.run(Thread.java:534)
Caused by: java.io.EOFException
	at java.io.DataInputStream.readByte(DataInputStream.java:333)
	at org.activemq.io.AbstractWireFormat.readPacket(AbstractWireFormat.java:230)
	at org.activemq.transport.tcp.TcpTransportChannel.run(TcpTransportChannel.java:313)
	... 1 more
[INFO] Client reconnect failed.  Trying again in 5000 milliseconds. (Initialization of TcpTransportChannel
failed. URI was: tcp://localhost:61616 Reason: java.net.ConnectException: Connection refused)
Jan 12, 2006 9:57:31 PM org.activemq.broker.impl.BrokerContainerImpl stop
INFO: ActiveMQ JMS Message Broker (ID:stan.gbuild.org-33635-1137131844656-13:0) stopped
[surefire] Running org.apache.geronimo.gbuild.agent.ContinuumBuildAgentTest
[surefire] Tests run: 2, Failures: 0, Errors: 0, Time elapsed: 6.801 sec
[info] include-writer - Include files will be written to /home/continuum/build/work/17/target
[debug] include-writer - Pattern ^include.*
[debug] include-writer - Found include pattern include.hello
[info] include-writer - Writing 6 characters to /home/continuum/build/work/17/target/include-test/one.properties
[surefire] Running org.apache.geronimo.gbuild.agent.WriteIncludeFileExtentionTest
[surefire] Tests run: 1, Failures: 0, Errors: 0, Time elapsed: 0.007 sec
[debug] 6654910 - Doing initial scan of /tmp/dirscan51329
[debug] 6654910 - File Discovered: /tmp/dirscan51329/aaa
[info] 6654910 - New File: /tmp/dirscan51329/aaa
[debug] 6654910 - File Changing: /tmp/dirscan51329/aaa
[info] 6654910 - Updated File: /tmp/dirscan51329/aaa
[info] 6654910 - File removed: /tmp/dirscan51329/aaa
[debug] 6654910 - File Discovered: /tmp/dirscan51329/aaa
[info] 6654910 - New File: /tmp/dirscan51329/aaa
[surefire] Running org.apache.geronimo.gbuild.agent.DirectoryMonitorTest
[surefire] Tests run: 1, Failures: 0, Errors: 0, Time elapsed: 0.011 sec
[surefire] Running org.apache.geronimo.gbuild.agent.StringTemplateTest
[surefire] Tests run: 1, Failures: 0, Errors: 0, Time elapsed: 0.001 sec
[surefire] Running org.apache.geronimo.gbuild.agent.KillProcessesExtensionTest
[surefire] Tests run: 1, Failures: 1, Errors: 0, Time elapsed: 0.056 sec <<<<<<<<
FAILURE !! 

Results :
[surefire] Tests run: 6, Failures: 1, Errors: 0

[INFO] ----------------------------------------------------------------------------
[ERROR] BUILD ERROR
[INFO] ----------------------------------------------------------------------------
[INFO] There are some test failure.
[INFO] ----------------------------------------------------------------------------
[INFO] For more information, run Maven with the -e switch
[INFO] ----------------------------------------------------------------------------
[INFO] Total time: 14 seconds
[INFO] Finished at: Thu Jan 12 21:57:31 PST 2006
[INFO] Final Memory: 14M/26M
[INFO] ----------------------------------------------------------------------------

****************************************************************************



Mime
View raw message