geronimo-scm mailing list archives

Site index · List index
Message view « Date » · « Thread »
Top « Date » · « Thread »
From continuum <contin...@stan.gbuild.org>
Subject [continuum] BUILD FAILURE: GBuild Agent Application
Date Fri, 13 Jan 2006 05:31:17 GMT
Online report : http://ci.gbuild.org/continuum/target/ProjectBuild.vm/view/ProjectBuild/id/20/buildId/747
Build statistics:
  State: Failed
  Previous State: Failed
  Started at: Thu, 12 Jan 2006 21:30:40 -0800
  Finished at: Thu, 12 Jan 2006 21:31:17 -0800
  Total time: 36s
  Build Trigger: Forced
  Exit code: 1
  Building machine hostname: stan.gbuild.org
  Operating system : Linux(unknown)
  Java version : 1.4.2_08(Sun Microsystems Inc.)

Changes
      No files changed
  
****************************************************************************
Output:
****************************************************************************
[INFO] Scanning for projects...
[INFO] ----------------------------------------------------------------------------
[INFO] Building GBuild Agent Application
[INFO]    task-segment: [clean, install]
[INFO] ----------------------------------------------------------------------------
[ERROR] Nonexistent component: org.apache.maven.lifecycle.mapping.LifecycleMappingplexus-application
[INFO] [clean:clean]
[INFO] Deleting directory /home/continuum/build/work/20/target
[INFO] [plexus:descriptor {execution: default}]
[WARNING] Specified source directory isn't a directory: '/home/continuum/build/work/20/src/main/java'.
[WARNING] 
	Artifact junit:junit:jar:3.8.1 retains local scope 'test' overriding broader scope 'compile'
	given by a dependency. If this is not intended, modify or remove the local scope.

[WARNING] 
  This artifact has been relocated to javax.jdo:jdo:2.0-20050809.1515.


[WARNING] 
  This artifact has been relocated to xml-apis:xml-apis:1.0.b2.


[WARNING] 
  This artifact has been relocated to xml-apis:xml-apis:1.0.b2.


Downloading: http://cvs.apache.org/repository/org.apache.geronimo.gbuild/poms/gbuild-agent-web-1.0-SNAPSHOT.pom
[WARNING] Unable to get resource from repository apache.snapshots (http://cvs.apache.org/repository)
Downloading: http://snapshots.maven.codehaus.org/maven2/org/apache/geronimo/gbuild/gbuild-agent-web/1.0-SNAPSHOT/gbuild-agent-web-1.0-SNAPSHOT.pom
[WARNING] Unable to get resource from repository snapshots (http://snapshots.maven.codehaus.org/maven2)
[WARNING] 
  This artifact has been relocated to org.springframework:spring:1.2.2.


[WARNING] 
  This artifact has been relocated to xml-apis:xml-apis:1.0.b2.


[WARNING] 
  This artifact has been relocated to xml-apis:xml-apis:1.0.b2.


[WARNING] 
  This artifact has been relocated to xml-apis:xml-apis:1.0.b2.


Downloading: http://cvs.apache.org/repository/org.apache.geronimo.gbuild/poms/gbuild-agent-1.0-SNAPSHOT.pom
[WARNING] Unable to get resource from repository apache.snapshots (http://cvs.apache.org/repository)
Downloading: http://snapshots.maven.codehaus.org/maven2/org/apache/geronimo/gbuild/gbuild-agent/1.0-SNAPSHOT/gbuild-agent-1.0-SNAPSHOT.pom
[WARNING] Unable to get resource from repository snapshots (http://snapshots.maven.codehaus.org/maven2)
Downloading: http://cvs.apache.org/repository/org.apache.maven.reporting/jars/maven-reporting-api-2.0.jar
[WARNING] Unable to get resource from repository apache.snapshots (http://cvs.apache.org/repository)
Downloading: http://repo1.maven.org/maven2/org/apache/maven/reporting/maven-reporting-api/2.0/maven-reporting-api-2.0.jar
6K downloaded
Downloading: http://cvs.apache.org/repository/org.apache.maven/jars/maven-core-2.0.jar
[WARNING] Unable to get resource from repository apache.snapshots (http://cvs.apache.org/repository)
Downloading: http://repo1.maven.org/maven2/org/apache/maven/maven-core/2.0/maven-core-2.0.jar
132K downloaded
Downloading: http://cvs.apache.org/repository/org.apache.maven/jars/maven-plugin-descriptor-2.0.jar
[WARNING] Unable to get resource from repository apache.snapshots (http://cvs.apache.org/repository)
Downloading: http://repo1.maven.org/maven2/org/apache/maven/maven-plugin-descriptor/2.0/maven-plugin-descriptor-2.0.jar
32K downloaded
Downloading: http://cvs.apache.org/repository/log4j/jars/log4j-1.2.8.jar
[WARNING] Unable to get resource from repository apache.snapshots (http://cvs.apache.org/repository)
Downloading: http://repo1.maven.org/maven2/log4j/log4j/1.2.8/log4j-1.2.8.jar
344K downloaded
Downloading: http://cvs.apache.org/repository/org.apache.maven.wagon/jars/wagon-ssh-1.0-alpha-5.jar
[WARNING] Unable to get resource from repository apache.snapshots (http://cvs.apache.org/repository)
Downloading: http://repo1.maven.org/maven2/org/apache/maven/wagon/wagon-ssh/1.0-alpha-5/wagon-ssh-1.0-alpha-5.jar
32K downloaded
Downloading: http://snapshots.maven.codehaus.org/maven2/org/apache/maven/scm/maven-scm-provider-svn/1.0-beta-1-SNAPSHOT/maven-scm-provider-svn-1.0-beta-1-20051114.124603-4.jar
47K downloaded
Downloading: http://cvs.apache.org/repository/quartz/jars/quartz-1.4.5.jar
[WARNING] Unable to get resource from repository apache.snapshots (http://cvs.apache.org/repository)
Downloading: http://repo1.maven.org/maven2/quartz/quartz/1.4.5/quartz-1.4.5.jar
315K downloaded
Downloading: http://cvs.apache.org/repository/org.codehaus.plexus/jars/plexus-log4j-logging-1.1-alpha-1.jar
[WARNING] Unable to get resource from repository apache.snapshots (http://cvs.apache.org/repository)
Downloading: http://repo1.maven.org/maven2/org/codehaus/plexus/plexus-log4j-logging/1.1-alpha-1/plexus-log4j-logging-1.1-alpha-1.jar
10K downloaded
Downloading: http://cvs.apache.org/repository/com.jcraft/jars/jsch-0.1.23.jar
[WARNING] Unable to get resource from repository apache.snapshots (http://cvs.apache.org/repository)
Downloading: http://repo1.maven.org/maven2/com/jcraft/jsch/0.1.23/jsch-0.1.23.jar
113K downloaded
Downloading: http://cvs.apache.org/repository/org.apache.maven/jars/maven-monitor-2.0.jar
[WARNING] Unable to get resource from repository apache.snapshots (http://cvs.apache.org/repository)
Downloading: http://repo1.maven.org/maven2/org/apache/maven/maven-monitor/2.0/maven-monitor-2.0.jar
7K downloaded
Downloading: http://cvs.apache.org/repository/org.apache.maven/jars/maven-settings-2.0.jar
[WARNING] Unable to get resource from repository apache.snapshots (http://cvs.apache.org/repository)
Downloading: http://repo1.maven.org/maven2/org/apache/maven/maven-settings/2.0/maven-settings-2.0.jar
42K downloaded
Downloading: http://cvs.apache.org/repository/org.apache.geronimo.gbuild/jars/gbuild-agent-web-1.0-SNAPSHOT.jar
[WARNING] Unable to get resource from repository apache.snapshots (http://cvs.apache.org/repository)
Downloading: http://snapshots.maven.codehaus.org/maven2/org/apache/geronimo/gbuild/gbuild-agent-web/1.0-SNAPSHOT/gbuild-agent-web-1.0-SNAPSHOT.jar
[WARNING] Unable to get resource from repository snapshots (http://snapshots.maven.codehaus.org/maven2)
[INFO] ----------------------------------------------------------------------------
[ERROR] BUILD ERROR
[INFO] ----------------------------------------------------------------------------
[INFO] Failed to resolve artifact.

GroupId: org.apache.geronimo.gbuild
ArtifactId: gbuild-agent-web
Version: 1.0-SNAPSHOT

Reason: Unable to download the artifact from any repository
  org.apache.geronimo.gbuild:gbuild-agent-web:1.0-SNAPSHOT:jar

from the specified remote repositories:
  central (http://repo1.maven.org/maven2),
  apache.snapshots (http://cvs.apache.org/repository),
  snapshots (http://snapshots.maven.codehaus.org/maven2)


[INFO] ----------------------------------------------------------------------------
[INFO] For more information, run Maven with the -e switch
[INFO] ----------------------------------------------------------------------------
[INFO] Total time: 35 seconds
[INFO] Finished at: Thu Jan 12 21:31:17 PST 2006
[INFO] Final Memory: 7M/12M
[INFO] ----------------------------------------------------------------------------

****************************************************************************



Mime
View raw message