geronimo-scm mailing list archives

Site index · List index
Message view « Date » · « Thread »
Top « Date » · « Thread »
From continuum <contin...@stan.gbuild.org>
Subject [continuum] BUILD FAILURE: GBuild Agent
Date Tue, 17 Jan 2006 15:05:53 GMT
Online report : http://ci.gbuild.org/continuum/target/ProjectBuild.vm/view/ProjectBuild/id/17/buildId/838
Build statistics:
  State: Failed
  Previous State: Failed
  Started at: Tue, 17 Jan 2006 06:59:22 -0800
  Finished at: Tue, 17 Jan 2006 07:05:53 -0800
  Total time: 6m 30s
  Build Trigger: Forced
  Exit code: 1
  Building machine hostname: stan.gbuild.org
  Operating system : Linux(unknown)
  Java version : 1.4.2_08(Sun Microsystems Inc.)

Changes
      No files changed
  
****************************************************************************
Output:
****************************************************************************
[INFO] Scanning for projects...
[INFO] ----------------------------------------------------------------------------
[INFO] Building GBuild Agent
[INFO]    task-segment: [clean, install]
[INFO] ----------------------------------------------------------------------------
[INFO] [clean:clean]
[INFO] Deleting directory /home/continuum/build/work/17/target
[INFO] [plexus:descriptor {execution: default}]
[INFO] [resources:resources]
[INFO] Using default encoding to copy filtered resources.
[WARNING] 
	Artifact junit:junit:jar:3.8.1 retains local scope 'test' overriding broader scope 'compile'
	given by a dependency. If this is not intended, modify or remove the local scope.

[WARNING] 
  This artifact has been relocated to javax.jdo:jdo:2.0-20050809.1515.


Downloading: http://cvs.apache.org/repository/org.apache.maven.scm/poms/maven-scm-providers-1.0-beta-2.pom
[WARNING] Unable to get resource from repository apache (http://cvs.apache.org/repository)
Downloading: http://people.apache.org/~dblevins/maven/org.apache.maven.scm/poms/maven-scm-providers-1.0-beta-2.pom
[WARNING] Unable to get resource from repository dblevins (http://people.apache.org/~dblevins/maven)
Downloading: http://repo1.maven.org/maven2/org/apache/maven/scm/maven-scm-providers/1.0-beta-2/maven-scm-providers-1.0-beta-2.pom
1K downloaded
Downloading: http://cvs.apache.org/repository/org.apache.maven.continuum/poms/continuum-store-1.0.2.pom
[WARNING] Unable to get resource from repository apache (http://cvs.apache.org/repository)
Downloading: http://people.apache.org/~dblevins/maven/org.apache.maven.continuum/poms/continuum-store-1.0.2.pom
[WARNING] Unable to get resource from repository dblevins (http://people.apache.org/~dblevins/maven)
Downloading: http://repo1.maven.org/maven2/org/apache/maven/continuum/continuum-store/1.0.2/continuum-store-1.0.2.pom
1K downloaded
[WARNING] 
  This artifact has been relocated to xml-apis:xml-apis:1.0.b2.


[WARNING] 
  This artifact has been relocated to xml-apis:xml-apis:1.0.b2.


Downloading: http://cvs.apache.org/repository/org.apache.maven.scm/poms/maven-scm-manager-plexus-1.0-beta-2.pom
[WARNING] Unable to get resource from repository apache (http://cvs.apache.org/repository)
Downloading: http://people.apache.org/~dblevins/maven/org.apache.maven.scm/poms/maven-scm-manager-plexus-1.0-beta-2.pom
[WARNING] Unable to get resource from repository dblevins (http://people.apache.org/~dblevins/maven)
Downloading: http://repo1.maven.org/maven2/org/apache/maven/scm/maven-scm-manager-plexus/1.0-beta-2/maven-scm-manager-plexus-1.0-beta-2.pom
614b downloaded
Downloading: http://cvs.apache.org/repository/org.apache.maven.scm/poms/maven-scm-managers-1.0-beta-2.pom
[WARNING] Unable to get resource from repository apache (http://cvs.apache.org/repository)
Downloading: http://people.apache.org/~dblevins/maven/org.apache.maven.scm/poms/maven-scm-managers-1.0-beta-2.pom
[WARNING] Unable to get resource from repository dblevins (http://people.apache.org/~dblevins/maven)
Downloading: http://repo1.maven.org/maven2/org/apache/maven/scm/maven-scm-managers/1.0-beta-2/maven-scm-managers-1.0-beta-2.pom
627b downloaded
Downloading: http://cvs.apache.org/repository/incubator-activemq/poms/activemq-core-4.0-M4.pom
[WARNING] Unable to get resource from repository apache (http://cvs.apache.org/repository)
Downloading: http://people.apache.org/~dblevins/maven/incubator-activemq/poms/activemq-core-4.0-M4.pom
17K downloaded
[WARNING] POM for: 'incubator-activemq:activemq-core:pom:4.0-M4' does not appear to be valid.
Its will be ignored for artifact resolution.

Reason: Invalid POM (not v4.0.0 modelVersion)


[INFO] snapshot org.apache.maven.scm:maven-scm-provider-cvs:1.0-beta-1-SNAPSHOT: checking
for updates from apache
[INFO] snapshot org.apache.maven.scm:maven-scm-provider-cvs:1.0-beta-1-SNAPSHOT: checking
for updates from dblevins
[INFO] snapshot org.apache.maven.scm:maven-scm-provider-cvs:1.0-beta-1-SNAPSHOT: checking
for updates from snapshots
[INFO] snapshot org.apache.maven.scm:maven-scm-providers:1.0-beta-1-SNAPSHOT: checking for
updates from apache
[INFO] snapshot org.apache.maven.scm:maven-scm-providers:1.0-beta-1-SNAPSHOT: checking for
updates from dblevins
[INFO] snapshot org.apache.maven.scm:maven-scm-providers:1.0-beta-1-SNAPSHOT: checking for
updates from snapshots
[INFO] snapshot org.apache.maven.scm:maven-scm:1.0-beta-1-SNAPSHOT: checking for updates from
apache
[INFO] snapshot org.apache.maven.scm:maven-scm:1.0-beta-1-SNAPSHOT: checking for updates from
dblevins
[INFO] snapshot org.apache.maven.scm:maven-scm:1.0-beta-1-SNAPSHOT: checking for updates from
snapshots
[INFO] snapshot org.apache.maven.scm:maven-scm-api:1.0-beta-1-SNAPSHOT: checking for updates
from apache
[INFO] snapshot org.apache.maven.scm:maven-scm-api:1.0-beta-1-SNAPSHOT: checking for updates
from dblevins
[INFO] snapshot org.apache.maven.scm:maven-scm-api:1.0-beta-1-SNAPSHOT: checking for updates
from snapshots
[WARNING] POM for: 'activeio:activeio:pom:2.1' does not appear to be valid. Its will be ignored
for artifact resolution.

Reason: Invalid POM (not v4.0.0 modelVersion)


Downloading: http://cvs.apache.org/repository/org.apache.maven.scm/jars/maven-scm-api-1.0-beta-2.jar
[WARNING] Unable to get resource from repository apache (http://cvs.apache.org/repository)
Downloading: http://people.apache.org/~dblevins/maven/org.apache.maven.scm/jars/maven-scm-api-1.0-beta-2.jar
[WARNING] Unable to get resource from repository dblevins (http://people.apache.org/~dblevins/maven)
Downloading: http://cvs.apache.org/repository/org.apache.maven.scm/jars/maven-scm-api-1.0-beta-2.jar
[WARNING] Unable to get resource from repository apache.snapshots (http://cvs.apache.org/repository)
Downloading: http://repo1.maven.org/maven2/org/apache/maven/scm/maven-scm-api/1.0-beta-2/maven-scm-api-1.0-beta-2.jar
55K downloaded
Downloading: http://cvs.apache.org/repository/org.apache.maven.continuum/jars/continuum-api-1.0.2.jar
[WARNING] Unable to get resource from repository apache (http://cvs.apache.org/repository)
Downloading: http://people.apache.org/~dblevins/maven/org.apache.maven.continuum/jars/continuum-api-1.0.2.jar
[WARNING] Unable to get resource from repository dblevins (http://people.apache.org/~dblevins/maven)
Downloading: http://repo1.maven.org/maven2/org/apache/maven/continuum/continuum-api/1.0.2/continuum-api-1.0.2.jar
28K downloaded
Downloading: http://cvs.apache.org/repository/org.apache.maven.scm/jars/maven-scm-provider-svn-1.0-beta-2.jar
[WARNING] Unable to get resource from repository apache (http://cvs.apache.org/repository)
Downloading: http://people.apache.org/~dblevins/maven/org.apache.maven.scm/jars/maven-scm-provider-svn-1.0-beta-2.jar
[WARNING] Unable to get resource from repository dblevins (http://people.apache.org/~dblevins/maven)
Downloading: http://cvs.apache.org/repository/org.apache.maven.scm/jars/maven-scm-provider-svn-1.0-beta-2.jar
[WARNING] Unable to get resource from repository apache.snapshots (http://cvs.apache.org/repository)
Downloading: http://repo1.maven.org/maven2/org/apache/maven/scm/maven-scm-provider-svn/1.0-beta-2/maven-scm-provider-svn-1.0-beta-2.jar
48K downloaded
Downloading: http://cvs.apache.org/repository/org.apache.maven.continuum/jars/continuum-core-1.0.2.jar
[WARNING] Unable to get resource from repository apache (http://cvs.apache.org/repository)
Downloading: http://people.apache.org/~dblevins/maven/org.apache.maven.continuum/jars/continuum-core-1.0.2.jar
[WARNING] Unable to get resource from repository dblevins (http://people.apache.org/~dblevins/maven)
Downloading: http://repo1.maven.org/maven2/org/apache/maven/continuum/continuum-core/1.0.2/continuum-core-1.0.2.jar
130K downloaded
Downloading: http://cvs.apache.org/repository/org.apache.maven.scm/jars/maven-scm-manager-plexus-1.0-beta-2.jar
[WARNING] Unable to get resource from repository apache (http://cvs.apache.org/repository)
Downloading: http://people.apache.org/~dblevins/maven/org.apache.maven.scm/jars/maven-scm-manager-plexus-1.0-beta-2.jar
[WARNING] Unable to get resource from repository dblevins (http://people.apache.org/~dblevins/maven)
Downloading: http://cvs.apache.org/repository/org.apache.maven.scm/jars/maven-scm-manager-plexus-1.0-beta-2.jar
[WARNING] Unable to get resource from repository apache.snapshots (http://cvs.apache.org/repository)
Downloading: http://repo1.maven.org/maven2/org/apache/maven/scm/maven-scm-manager-plexus/1.0-beta-2/maven-scm-manager-plexus-1.0-beta-2.jar
6K downloaded
Downloading: http://cvs.apache.org/repository/org.codehaus.plexus/jars/plexus-utils-1.0.5.jar
[WARNING] Unable to get resource from repository apache (http://cvs.apache.org/repository)
Downloading: http://people.apache.org/~dblevins/maven/org.codehaus.plexus/jars/plexus-utils-1.0.5.jar
[WARNING] Unable to get resource from repository dblevins (http://people.apache.org/~dblevins/maven)
Downloading: http://cvs.apache.org/repository/org.codehaus.plexus/jars/plexus-utils-1.0.5.jar
[WARNING] Unable to get resource from repository apache.snapshots (http://cvs.apache.org/repository)
Downloading: http://repo1.maven.org/maven2/org/codehaus/plexus/plexus-utils/1.0.5/plexus-utils-1.0.5.jar
164K downloaded
Downloading: http://cvs.apache.org/repository/org.apache.maven.continuum/jars/continuum-store-1.0.2.jar
[WARNING] Unable to get resource from repository apache (http://cvs.apache.org/repository)
Downloading: http://people.apache.org/~dblevins/maven/org.apache.maven.continuum/jars/continuum-store-1.0.2.jar
[WARNING] Unable to get resource from repository dblevins (http://people.apache.org/~dblevins/maven)
Downloading: http://cvs.apache.org/repository/org.apache.maven.continuum/jars/continuum-store-1.0.2.jar
[WARNING] Unable to get resource from repository apache.snapshots (http://cvs.apache.org/repository)
Downloading: http://repo1.maven.org/maven2/org/apache/maven/continuum/continuum-store/1.0.2/continuum-store-1.0.2.jar
16K downloaded
Downloading: http://cvs.apache.org/repository/org.codehaus.plexus/jars/plexus-formica-1.0-beta-9.jar
[WARNING] Unable to get resource from repository apache (http://cvs.apache.org/repository)
Downloading: http://people.apache.org/~dblevins/maven/org.codehaus.plexus/jars/plexus-formica-1.0-beta-9.jar
[WARNING] Unable to get resource from repository dblevins (http://people.apache.org/~dblevins/maven)
Downloading: http://cvs.apache.org/repository/org.codehaus.plexus/jars/plexus-formica-1.0-beta-9.jar
[WARNING] Unable to get resource from repository apache.snapshots (http://cvs.apache.org/repository)
Downloading: http://repo1.maven.org/maven2/org/codehaus/plexus/plexus-formica/1.0-beta-9/plexus-formica-1.0-beta-9.jar
51K downloaded
Downloading: http://cvs.apache.org/repository/org.apache.maven.continuum/jars/continuum-notifier-api-1.0.2.jar
[WARNING] Unable to get resource from repository apache (http://cvs.apache.org/repository)
Downloading: http://people.apache.org/~dblevins/maven/org.apache.maven.continuum/jars/continuum-notifier-api-1.0.2.jar
[WARNING] Unable to get resource from repository dblevins (http://people.apache.org/~dblevins/maven)
Downloading: http://cvs.apache.org/repository/org.apache.maven.continuum/jars/continuum-notifier-api-1.0.2.jar
[WARNING] Unable to get resource from repository apache.snapshots (http://cvs.apache.org/repository)
Downloading: http://repo1.maven.org/maven2/org/apache/maven/continuum/continuum-notifier-api/1.0.2/continuum-notifier-api-1.0.2.jar
5K downloaded
Downloading: http://cvs.apache.org/repository/org.apache.maven.continuum/jars/continuum-model-1.0.2.jar
[WARNING] Unable to get resource from repository apache (http://cvs.apache.org/repository)
Downloading: http://people.apache.org/~dblevins/maven/org.apache.maven.continuum/jars/continuum-model-1.0.2.jar
[WARNING] Unable to get resource from repository dblevins (http://people.apache.org/~dblevins/maven)
Downloading: http://repo1.maven.org/maven2/org/apache/maven/continuum/continuum-model/1.0.2/continuum-model-1.0.2.jar
108K downloaded
Downloading: http://cvs.apache.org/repository/incubator-activemq/jars/activemq-core-4.0-M4.jar
[WARNING] Unable to get resource from repository apache (http://cvs.apache.org/repository)
Downloading: http://people.apache.org/~dblevins/maven/incubator-activemq/jars/activemq-core-4.0-M4.jar
1013K downloaded
[INFO] [compiler:compile]
Compiling 36 source files to /home/continuum/build/work/17/target/classes
[INFO] [resources:testResources]
[INFO] Using default encoding to copy filtered resources.
[WARNING] 
  This artifact has been relocated to javax.jdo:jdo:2.0-20050809.1515.


[WARNING] 
  This artifact has been relocated to xml-apis:xml-apis:1.0.b2.


[WARNING] 
  This artifact has been relocated to xml-apis:xml-apis:1.0.b2.


[WARNING] POM for: 'incubator-activemq:activemq-core:pom:4.0-M4' does not appear to be valid.
Its will be ignored for artifact resolution.

Reason: Invalid POM (not v4.0.0 modelVersion)


[WARNING] POM for: 'activeio:activeio:pom:2.1' does not appear to be valid. Its will be ignored
for artifact resolution.

Reason: Invalid POM (not v4.0.0 modelVersion)


[INFO] [compiler:testCompile]
Compiling 9 source files to /home/continuum/build/work/17/target/test-classes
[WARNING] 
  This artifact has been relocated to javax.jdo:jdo:2.0-20050809.1515.


[WARNING] 
  This artifact has been relocated to xml-apis:xml-apis:1.0.b2.


[WARNING] 
  This artifact has been relocated to xml-apis:xml-apis:1.0.b2.


[WARNING] POM for: 'incubator-activemq:activemq-core:pom:4.0-M4' does not appear to be valid.
Its will be ignored for artifact resolution.

Reason: Invalid POM (not v4.0.0 modelVersion)


[WARNING] POM for: 'activeio:activeio:pom:2.1' does not appear to be valid. Its will be ignored
for artifact resolution.

Reason: Invalid POM (not v4.0.0 modelVersion)


[INFO] [surefire:test]
[INFO] Setting reports dir: /home/continuum/build/work/17/target/surefire-reports

-------------------------------------------------------
 T E S T S
-------------------------------------------------------
Jan 17, 2006 7:05:45 AM org.apache.activemq.broker.BrokerService getBroker
INFO: ActiveMQ 4.0-M4 JMS Message Broker (localhost) is starting
Jan 17, 2006 7:05:45 AM org.apache.activemq.broker.BrokerService getBroker
INFO: For help or more information please see: http://www.logicblaze.com
Jan 17, 2006 7:05:48 AM org.apache.activemq.store.jdbc.JDBCPersistenceAdapter createAdapter
INFO: Database driver recognized: [apache_derby_embedded_jdbc_driver]
Jan 17, 2006 7:05:49 AM org.apache.activemq.store.journal.JournalPersistenceAdapter recover
INFO: Journal Recovery Started from: Active Journal: using 2 x 20.0 Megs at: activemq-data/localhost/journal
Jan 17, 2006 7:05:49 AM org.apache.activemq.store.journal.JournalPersistenceAdapter recover
INFO: Journal Recovered: 0 message(s) in transactions recovered.
Jan 17, 2006 7:05:49 AM org.apache.activemq.transport.TransportServerThreadSupport start
INFO: Listening for connections at: tcp://stan.gbuild.org:61616
Jan 17, 2006 7:05:49 AM org.apache.activemq.broker.TransportConnector start
INFO: Accepting connection on: tcp://stan.gbuild.org:61616
Jan 17, 2006 7:05:49 AM org.apache.activemq.broker.BrokerService start
INFO: ActiveMQ JMS Message Broker (localhost) started
[INFO] Client connected: tcp://localhost:61616
[INFO] Continuum Build Agent starting.
[INFO] Continuum Build Agent started and waiting for work.
[INFO] Updating project: id: '10', name 'Shell Project'.
[INFO] Executing: cvs -f -q update -d
[INFO] Working directory: /home/continuum/build/work/17/agent/work/10
[WARNING] Could not find the executable 'ant' in the path '[]'.
[WARNING] Could not find the executable 'maven' in the path '[]'.
[WARNING] Could not find the executable 'mvn' in the path '[]'.
[INFO] Build executors:
[INFO]   maven-1
[INFO]   ant
[INFO]   maven2
[INFO]   shell
[INFO] Updating project 'Shell Project' from checkout.
[WARNING] Executable '/home/continuum/build/work/17/target/it/shell/script.sh'.
[INFO] Arguments: 
[INFO] Working directory: /home/continuum/build/work/17/agent/work/10
[INFO] Exit code: 0
Jan 17, 2006 7:05:50 AM org.apache.activemq.broker.BrokerService stop
INFO: ActiveMQ Message Broker (localhost) is shutting down
Jan 17, 2006 7:05:50 AM org.apache.activemq.broker.BrokerService stop
INFO: ActiveMQ JMS Message Broker (localhost) stopped
Jan 17, 2006 7:05:51 AM org.apache.activemq.broker.BrokerService getBroker
INFO: ActiveMQ 4.0-M4 JMS Message Broker (localhost) is starting
Jan 17, 2006 7:05:51 AM org.apache.activemq.broker.BrokerService getBroker
INFO: For help or more information please see: http://www.logicblaze.com
Jan 17, 2006 7:05:51 AM org.apache.activemq.store.jdbc.JDBCPersistenceAdapter createAdapter
INFO: Database driver recognized: [apache_derby_embedded_jdbc_driver]
Jan 17, 2006 7:05:51 AM org.apache.activemq.store.journal.JournalPersistenceAdapter recover
INFO: Journal Recovery Started from: Active Journal: using 2 x 20.0 Megs at: activemq-data/localhost/journal
Jan 17, 2006 7:05:51 AM org.apache.activemq.store.journal.JournalPersistenceAdapter recover
INFO: Journal Recovered: 0 message(s) in transactions recovered.
Jan 17, 2006 7:05:51 AM org.apache.activemq.transport.TransportServerThreadSupport start
INFO: Listening for connections at: tcp://stan.gbuild.org:61616
Jan 17, 2006 7:05:51 AM org.apache.activemq.broker.TransportConnector start
INFO: Accepting connection on: tcp://stan.gbuild.org:61616
Jan 17, 2006 7:05:51 AM org.apache.activemq.broker.BrokerService start
INFO: ActiveMQ JMS Message Broker (localhost) started
[INFO] Client connected: tcp://localhost:61616
[INFO] Continuum Build Agent starting.
[INFO] Continuum Build Agent started and waiting for work.
[INFO] Continuum Build Agent starting.
[INFO] Continuum Build Agent started and waiting for work.
[INFO] Message Received ID:stan.gbuild.org-46789-1137510349402-2:1:1:1:1 on ID:stan.gbuild.org-46789-1137510349402-3:2:BUILD.TASKS
[INFO] Message Received ID:stan.gbuild.org-46789-1137510349402-2:1:1:1:2 on ID:stan.gbuild.org-46789-1137510349402-3:2:BUILD.TASKS
[INFO] Executing extention clean-dead-processes pre process
[INFO] Executing extention general-headers pre process
[INFO] Executing extention report-activity pre process
[INFO] Executing extention clean-dead-processes pre process
[INFO] Executing extention general-headers pre process
[INFO] Executing extention report-activity pre process
[INFO] Executing extention build-output pre process
[INFO] Executing extention file-include pre process
[INFO] Executing extention build-output pre process
[INFO] Executing extention file-include pre process
[INFO] Updating project: id: '12', name 'Shell Project'.
[INFO] Updating project: id: '12', name 'Shell Project'.
[INFO] Executing: cvs -f -q update -d
[INFO] Working directory: /home/continuum/build/work/17/agent/work/12
[INFO] Executing: cvs -f -q update -d
[INFO] Working directory: /home/continuum/build/work/17/agent/work/12
[WARNING] Could not find the executable 'ant' in the path '[]'.
[WARNING] Could not find the executable 'maven' in the path '[]'.
[WARNING] Could not find the executable 'mvn' in the path '[]'.
[INFO] Build executors:
[INFO]   maven-1
[INFO]   ant
[INFO]   maven2
[INFO]   shell
[INFO] Updating project 'Shell Project' from checkout.
[INFO] Updating project 'Shell Project' from checkout.
[WARNING] Executable '/home/continuum/build/work/17/target/it/shell/script.sh'.
[INFO] Arguments: two
[INFO] Working directory: /home/continuum/build/work/17/agent/work/12
[INFO] Exit code: 0
[WARNING] Executable '/home/continuum/build/work/17/target/it/shell/script.sh'.
[INFO] Arguments: one
[INFO] Working directory: /home/continuum/build/work/17/agent/work/12
[INFO] Executing extention clean-dead-processes post process
[INFO] Exit code: 0
[INFO] Executing extention clean-dead-processes post process
[INFO] Executing extention general-headers post process
[WARNING] replaced projectId = 12
[WARNING] replaced buildDefinitionId = 0
[INFO] Executing extention report-activity post process
[INFO] Executing extention general-headers post process
[WARNING] replaced projectId = 12
[WARNING] replaced buildDefinitionId = 1
[INFO] Executing extention report-activity post process
[INFO] Executing extention build-output post process
[INFO] Executing extention build-output post process
[INFO] Including 24 - /home/continuum/build/work/17/agent/output/12/0.log.txt
[INFO] Executing extention file-include post process
[INFO] Including 24 - /home/continuum/build/work/17/agent/output/12/0.log.txt
[INFO] Executing extention file-include post process
[INFO] Finished processing ID:stan.gbuild.org-46789-1137510349402-2:1:1:1:1
[INFO] Results sent to BUILD.RESULTS
[INFO] Finished processing ID:stan.gbuild.org-46789-1137510349402-2:1:1:1:2
[INFO] Message Received ID:stan.gbuild.org-46789-1137510349402-2:1:1:1:3 on ID:stan.gbuild.org-46789-1137510349402-3:2:BUILD.TASKS
[INFO] Results sent to BUILD.RESULTS
[INFO] Message Received ID:stan.gbuild.org-46789-1137510349402-2:1:1:1:4 on ID:stan.gbuild.org-46789-1137510349402-3:2:BUILD.TASKS
[INFO] Executing extention clean-dead-processes pre process
[INFO] Executing extention general-headers pre process
[INFO] Executing extention report-activity pre process
[INFO] Executing extention build-output pre process
[INFO] Executing extention file-include pre process
[INFO] Executing extention clean-dead-processes pre process
[INFO] Executing extention general-headers pre process
[INFO] Executing extention report-activity pre process
[INFO] Updating project: id: '12', name 'Shell Project'.
[INFO] Executing: cvs -f -q update -d
[INFO] Working directory: /home/continuum/build/work/17/agent/work/12
[INFO] Executing extention build-output pre process
[INFO] Executing extention file-include pre process
[INFO] Updating project: id: '12', name 'Shell Project'.
[RESULT] Shell Project : one : 1
[INFO] Executing: cvs -f -q update -d
[INFO] Working directory: /home/continuum/build/work/17/agent/work/12
[INFO] Updating project 'Shell Project' from checkout.
[WARNING] Executable '/home/continuum/build/work/17/target/it/shell/script.sh'.
[INFO] Arguments: three
[INFO] Working directory: /home/continuum/build/work/17/agent/work/12
[RESULT] Shell Project : two : 1
[INFO] Updating project 'Shell Project' from checkout.
[INFO] Exit code: 0
[WARNING] Executable '/home/continuum/build/work/17/target/it/shell/script.sh'.
[INFO] Arguments: four
[INFO] Working directory: /home/continuum/build/work/17/agent/work/12
[INFO] Executing extention clean-dead-processes post process
[INFO] Exit code: 0
[INFO] Executing extention clean-dead-processes post process
[INFO] Executing extention general-headers post process
[WARNING] replaced projectId = 12
[WARNING] replaced buildDefinitionId = 2
[INFO] Executing extention report-activity post process
[INFO] Executing extention build-output post process
[INFO] Including 25 - /home/continuum/build/work/17/agent/output/12/0.log.txt
[INFO] Executing extention file-include post process
[INFO] Finished processing ID:stan.gbuild.org-46789-1137510349402-2:1:1:1:3
[INFO] Results sent to BUILD.RESULTS
[INFO] Message Received ID:stan.gbuild.org-46789-1137510349402-2:1:1:1:5 on ID:stan.gbuild.org-46789-1137510349402-3:2:BUILD.TASKS
[INFO] Executing extention clean-dead-processes pre process
[INFO] Executing extention general-headers pre process
[INFO] Executing extention report-activity pre process
[INFO] Executing extention build-output pre process
[INFO] Executing extention file-include pre process
[INFO] Updating project: id: '12', name 'Shell Project'.
[INFO] Executing: cvs -f -q update -d
[INFO] Working directory: /home/continuum/build/work/17/agent/work/12
[INFO] Executing extention general-headers post process
[WARNING] replaced projectId = 12
[WARNING] replaced buildDefinitionId = 3
[INFO] Executing extention report-activity post process
[INFO] Executing extention build-output post process
[INFO] Including 25 - /home/continuum/build/work/17/agent/output/12/0.log.txt
[INFO] Executing extention file-include post process
[INFO] Finished processing ID:stan.gbuild.org-46789-1137510349402-2:1:1:1:4
[INFO] Results sent to BUILD.RESULTS
[INFO] Message Received ID:stan.gbuild.org-46789-1137510349402-2:1:1:1:6 on ID:stan.gbuild.org-46789-1137510349402-3:2:BUILD.TASKS
[INFO] Executing extention clean-dead-processes pre process
[INFO] Executing extention general-headers pre process
[INFO] Executing extention report-activity pre process
[INFO] Updating project 'Shell Project' from checkout.
[WARNING] Executable '/home/continuum/build/work/17/target/it/shell/script.sh'.
[INFO] Arguments: five
[INFO] Working directory: /home/continuum/build/work/17/agent/work/12
[RESULT] Shell Project : three : 1
[RESULT] Shell Project : four : 1
[INFO] Executing extention build-output pre process
[INFO] Executing extention file-include pre process
[INFO] Updating project: id: '12', name 'Shell Project'.
[INFO] Executing: cvs -f -q update -d
[INFO] Working directory: /home/continuum/build/work/17/agent/work/12
[INFO] Exit code: 0
[INFO] Executing extention clean-dead-processes post process
[INFO] Updating project 'Shell Project' from checkout.
[WARNING] Executable '/home/continuum/build/work/17/target/it/shell/script.sh'.
[INFO] Arguments: six
[INFO] Working directory: /home/continuum/build/work/17/agent/work/12
[INFO] Executing extention general-headers post process
[WARNING] replaced projectId = 12
[WARNING] replaced buildDefinitionId = 4
[INFO] Executing extention report-activity post process
[INFO] Executing extention build-output post process
[INFO] Including 20 - /home/continuum/build/work/17/agent/output/12/0.log.txt
[INFO] Executing extention file-include post process
[INFO] Finished processing ID:stan.gbuild.org-46789-1137510349402-2:1:1:1:5
[INFO] Exit code: 0
[INFO] Results sent to BUILD.RESULTS
[INFO] Message Received ID:stan.gbuild.org-46789-1137510349402-2:1:1:1:7 on ID:stan.gbuild.org-46789-1137510349402-3:2:BUILD.TASKS
[INFO] Executing extention clean-dead-processes pre process
[INFO] Executing extention general-headers pre process
[INFO] Executing extention report-activity pre process
[INFO] Executing extention clean-dead-processes post process
[INFO] Executing extention build-output pre process
[INFO] Executing extention file-include pre process
[INFO] Updating project: id: '12', name 'Shell Project'.
[INFO] Executing: cvs -f -q update -d
[INFO] Working directory: /home/continuum/build/work/17/agent/work/12
[RESULT] Shell Project : five : 1
[INFO] Updating project 'Shell Project' from checkout.
[WARNING] Executable '/home/continuum/build/work/17/target/it/shell/script.sh'.
[INFO] Arguments: seven
[INFO] Working directory: /home/continuum/build/work/17/agent/work/12
[INFO] Executing extention general-headers post process
[WARNING] replaced projectId = 12
[WARNING] replaced buildDefinitionId = 5
[INFO] Executing extention report-activity post process
[INFO] Executing extention build-output post process
[INFO] Including 24 - /home/continuum/build/work/17/agent/output/12/0.log.txt
[INFO] Executing extention file-include post process
[INFO] Finished processing ID:stan.gbuild.org-46789-1137510349402-2:1:1:1:6
[INFO] Results sent to BUILD.RESULTS
[INFO] Message Received ID:stan.gbuild.org-46789-1137510349402-2:1:1:1:8 on ID:stan.gbuild.org-46789-1137510349402-3:2:BUILD.TASKS
[INFO] Executing extention clean-dead-processes pre process
[INFO] Executing extention general-headers pre process
[INFO] Executing extention report-activity pre process
[RESULT] Shell Project : six : 1
[INFO] Exit code: 0
[INFO] Executing extention build-output pre process
[INFO] Executing extention file-include pre process
[INFO] Executing extention clean-dead-processes post process
[INFO] Updating project: id: '12', name 'Shell Project'.
[INFO] Executing: cvs -f -q update -d
[INFO] Working directory: /home/continuum/build/work/17/agent/work/12
[INFO] Updating project 'Shell Project' from checkout.
[WARNING] Executable '/home/continuum/build/work/17/target/it/shell/script.sh'.
[INFO] Arguments: eight
[INFO] Working directory: /home/continuum/build/work/17/agent/work/12
[INFO] Executing extention general-headers post process
[WARNING] replaced projectId = 12
[WARNING] replaced buildDefinitionId = 6
[INFO] Executing extention report-activity post process
[INFO] Executing extention build-output post process
[INFO] Including 26 - /home/continuum/build/work/17/agent/output/12/0.log.txt
[INFO] Executing extention file-include post process
[INFO] Finished processing ID:stan.gbuild.org-46789-1137510349402-2:1:1:1:7
[INFO] Results sent to BUILD.RESULTS
[INFO] Message Received ID:stan.gbuild.org-46789-1137510349402-2:1:1:1:9 on ID:stan.gbuild.org-46789-1137510349402-3:2:BUILD.TASKS
[INFO] Executing extention clean-dead-processes pre process
[INFO] Executing extention general-headers pre process
[INFO] Executing extention report-activity pre process
[INFO] Executing extention build-output pre process
[INFO] Executing extention file-include pre process
[INFO] Updating project: id: '12', name 'Shell Project'.
[INFO] Executing: cvs -f -q update -d
[INFO] Working directory: /home/continuum/build/work/17/agent/work/12
[RESULT] Shell Project : seven : 1
[INFO] Exit code: 0
[INFO] Updating project 'Shell Project' from checkout.
[INFO] Executing extention clean-dead-processes post process
[WARNING] Executable '/home/continuum/build/work/17/target/it/shell/script.sh'.
[INFO] Arguments: nine
[INFO] Working directory: /home/continuum/build/work/17/agent/work/12
[INFO] Executing extention general-headers post process
[WARNING] replaced projectId = 12
[WARNING] replaced buildDefinitionId = 7
[INFO] Executing extention report-activity post process
[INFO] Exit code: 0
[INFO] Executing extention clean-dead-processes post process
[INFO] Executing extention build-output post process
[INFO] Including 25 - /home/continuum/build/work/17/agent/output/12/0.log.txt
[INFO] Executing extention file-include post process
[INFO] Finished processing ID:stan.gbuild.org-46789-1137510349402-2:1:1:1:8
[INFO] Results sent to BUILD.RESULTS
[INFO] Message Received ID:stan.gbuild.org-46789-1137510349402-2:1:1:1:10 on ID:stan.gbuild.org-46789-1137510349402-3:2:BUILD.TASKS
[RESULT] Shell Project : eight : 1
[INFO] Executing extention clean-dead-processes pre process
[INFO] Executing extention general-headers pre process
[INFO] Executing extention report-activity pre process
[INFO] Executing extention build-output pre process
[INFO] Executing extention file-include pre process
[INFO] Updating project: id: '12', name 'Shell Project'.
[INFO] Executing: cvs -f -q update -d
[INFO] Working directory: /home/continuum/build/work/17/agent/work/12
[INFO] Executing extention general-headers post process
[WARNING] replaced projectId = 12
[WARNING] replaced buildDefinitionId = 8
[INFO] Executing extention report-activity post process
[INFO] Updating project 'Shell Project' from checkout.
[WARNING] Executable '/home/continuum/build/work/17/target/it/shell/script.sh'.
[INFO] Arguments: ten
[INFO] Working directory: /home/continuum/build/work/17/agent/work/12
[INFO] Executing extention build-output post process
[INFO] Including 25 - /home/continuum/build/work/17/agent/output/12/0.log.txt
[INFO] Executing extention file-include post process
[INFO] Finished processing ID:stan.gbuild.org-46789-1137510349402-2:1:1:1:9
[INFO] Results sent to BUILD.RESULTS
[INFO] Message Received ID:stan.gbuild.org-46789-1137510349402-2:1:1:1:11 on ID:stan.gbuild.org-46789-1137510349402-3:2:BUILD.TASKS
[INFO] Executing extention clean-dead-processes pre process
[INFO] Executing extention general-headers pre process
[INFO] Executing extention report-activity pre process
[INFO] Executing extention build-output pre process
[INFO] Executing extention file-include pre process
[INFO] Updating project: id: '12', name 'Shell Project'.
[INFO] Executing: cvs -f -q update -d
[INFO] Working directory: /home/continuum/build/work/17/agent/work/12
[RESULT] Shell Project : nine : 1
[INFO] Exit code: 0
[INFO] Executing extention clean-dead-processes post process
[INFO] Updating project 'Shell Project' from checkout.
[WARNING] Executable '/home/continuum/build/work/17/target/it/shell/script.sh'.
[INFO] Arguments: eleven
[INFO] Working directory: /home/continuum/build/work/17/agent/work/12
[INFO] Executing extention general-headers post process
[WARNING] replaced projectId = 12
[WARNING] replaced buildDefinitionId = 9
[INFO] Executing extention report-activity post process
[INFO] Executing extention build-output post process
[INFO] Including 20 - /home/continuum/build/work/17/agent/output/12/0.log.txt
[INFO] Executing extention file-include post process
[INFO] Finished processing ID:stan.gbuild.org-46789-1137510349402-2:1:1:1:10
[INFO] Exit code: 0
[INFO] Results sent to BUILD.RESULTS
[INFO] Message Received ID:stan.gbuild.org-46789-1137510349402-2:1:1:1:12 on ID:stan.gbuild.org-46789-1137510349402-3:2:BUILD.TASKS
[INFO] Executing extention clean-dead-processes post process
[RESULT] Shell Project : ten : 1
[INFO] Executing extention clean-dead-processes pre process
[INFO] Executing extention general-headers pre process
[INFO] Executing extention report-activity pre process
[INFO] Executing extention build-output pre process
[INFO] Executing extention file-include pre process
[INFO] Updating project: id: '12', name 'Shell Project'.
[INFO] Executing: cvs -f -q update -d
[INFO] Working directory: /home/continuum/build/work/17/agent/work/12
[INFO] Executing extention general-headers post process
[WARNING] replaced projectId = 12
[WARNING] replaced buildDefinitionId = 10
[INFO] Executing extention report-activity post process
[INFO] Executing extention build-output post process
[INFO] Including 27 - /home/continuum/build/work/17/agent/output/12/0.log.txt
[INFO] Executing extention file-include post process
[INFO] Finished processing ID:stan.gbuild.org-46789-1137510349402-2:1:1:1:11
[INFO] Results sent to BUILD.RESULTS
[INFO] Updating project 'Shell Project' from checkout.
[WARNING] Executable '/home/continuum/build/work/17/target/it/shell/script.sh'.
[INFO] Arguments: twelve
[INFO] Working directory: /home/continuum/build/work/17/agent/work/12
[RESULT] Shell Project : eleven : 1
[INFO] Exit code: 0
[INFO] Executing extention clean-dead-processes post process
[INFO] Executing extention general-headers post process
[WARNING] replaced projectId = 12
[WARNING] replaced buildDefinitionId = 11
[INFO] Executing extention report-activity post process
[INFO] Executing extention build-output post process
[INFO] Including 27 - /home/continuum/build/work/17/agent/output/12/0.log.txt
[INFO] Executing extention file-include post process
[INFO] Finished processing ID:stan.gbuild.org-46789-1137510349402-2:1:1:1:12
[INFO] Results sent to BUILD.RESULTS
[RESULT] Shell Project : twelve : 1
Jan 17, 2006 7:05:52 AM org.apache.activemq.broker.BrokerService stop
INFO: ActiveMQ Message Broker (localhost) is shutting down
[INFO] JMSException 6190691
[FATAL ERROR] JMS Exception occured.  Attempting reconnect.
javax.jms.JMSException: java.io.EOFException
	at org.apache.activemq.util.JMSExceptionSupport.create(JMSExceptionSupport.java:45)
	at org.apache.activemq.ActiveMQConnection.onAsyncException(ActiveMQConnection.java:1296)
	at org.apache.activemq.ActiveMQConnection.onException(ActiveMQConnection.java:1305)
	at org.apache.activemq.transport.TransportFilter.onException(TransportFilter.java:102)
	at org.apache.activemq.transport.TransportFilter.onException(TransportFilter.java:102)
	at org.apache.activemq.transport.TransportFilter.onException(TransportFilter.java:102)
	at org.apache.activemq.transport.TransportSupport.onException(TransportSupport.java:90)
	at org.apache.activemq.transport.tcp.TcpTransport.run(TcpTransport.java:149)
	at java.lang.Thread.run(Thread.java:534)
Caused by: java.io.EOFException
	at java.io.DataInputStream.readInt(DataInputStream.java:448)
	at org.apache.activemq.openwire.OpenWireFormat.unmarshal(OpenWireFormat.java:180)
	at org.apache.activemq.transport.tcp.TcpTransport.run(TcpTransport.java:135)
	... 1 more
[INFO] Client reconnect failed.  Trying again in 5000 milliseconds. (Could not connect to
broker URL: tcp://localhost:61616. Reason: java.net.ConnectException: Connection refused)
Jan 17, 2006 7:05:52 AM org.apache.activemq.broker.BrokerService stop
INFO: ActiveMQ JMS Message Broker (localhost) stopped
[surefire] Running org.apache.geronimo.gbuild.agent.ContinuumBuildAgentTest
[surefire] Tests run: 2, Failures: 0, Errors: 0, Time elapsed: 7.246 sec
[info] include-writer - Include files will be written to /home/continuum/build/work/17/target
[debug] include-writer - Pattern ^include.*
[debug] include-writer - Found include pattern include.hello
[info] include-writer - Writing 6 characters to /home/continuum/build/work/17/target/include-test/one.properties
[surefire] Running org.apache.geronimo.gbuild.agent.WriteIncludeFileExtentionTest
[surefire] Tests run: 1, Failures: 0, Errors: 0, Time elapsed: 0.006 sec
[debug] 2523263 - Doing initial scan of /tmp/dirscan52624
[debug] 2523263 - File Discovered: /tmp/dirscan52624/aaa
[info] 2523263 - New File: /tmp/dirscan52624/aaa
[debug] 2523263 - File Changing: /tmp/dirscan52624/aaa
[info] 2523263 - Updated File: /tmp/dirscan52624/aaa
[info] 2523263 - File removed: /tmp/dirscan52624/aaa
[debug] 2523263 - File Discovered: /tmp/dirscan52624/aaa
[info] 2523263 - New File: /tmp/dirscan52624/aaa
[surefire] Running org.apache.geronimo.gbuild.agent.DirectoryMonitorTest
[surefire] Tests run: 1, Failures: 0, Errors: 0, Time elapsed: 0.012 sec
[surefire] Running org.apache.geronimo.gbuild.agent.StringTemplateTest
[surefire] Tests run: 1, Failures: 0, Errors: 0, Time elapsed: 0.001 sec
[surefire] Running org.apache.geronimo.gbuild.agent.KillProcessesExtensionTest
[surefire] Tests run: 1, Failures: 1, Errors: 0, Time elapsed: 0.048 sec <<<<<<<<
FAILURE !! 

Results :
[surefire] Tests run: 6, Failures: 1, Errors: 0

[INFO] ----------------------------------------------------------------------------
[ERROR] BUILD ERROR
[INFO] ----------------------------------------------------------------------------
[INFO] There are some test failure.
[INFO] ----------------------------------------------------------------------------
[INFO] For more information, run Maven with the -e switch
[INFO] ----------------------------------------------------------------------------
[INFO] Total time: 6 minutes 28 seconds
[INFO] Finished at: Tue Jan 17 07:05:52 PST 2006
[INFO] Final Memory: 12M/24M
[INFO] ----------------------------------------------------------------------------

****************************************************************************



Mime
View raw message