geronimo-scm mailing list archives

Site index · List index
Message view « Date » · « Thread »
Top « Date » · « Thread »
From continuum <contin...@stan.gbuild.org>
Subject [continuum] BUILD FAILURE: GBuild Agent
Date Mon, 23 Jan 2006 13:35:45 GMT
Online report : http://ci.gbuild.org/continuum/target/ProjectBuild.vm/view/ProjectBuild/id/17/buildId/930
Build statistics:
  State: Failed
  Previous State: Failed
  Started at: Mon, 23 Jan 2006 05:35:14 -0800
  Finished at: Mon, 23 Jan 2006 05:35:45 -0800
  Total time: 30s
  Build Trigger: Forced
  Exit code: 1
  Building machine hostname: stan.gbuild.org
  Operating system : Linux(unknown)
  Java version : 1.4.2_08(Sun Microsystems Inc.)

Changes
                            src/test/java/org/apache/geronimo/gbuild/agent/ContinuumBuildAgentTest.java
            src/test/java/org/apache/geronimo/gbuild/agent/SVN.java
            pom.xml
        
****************************************************************************
Output:
****************************************************************************
[INFO] Scanning for projects...
[INFO] ----------------------------------------------------------------------------
[INFO] Building GBuild Agent
[INFO]    task-segment: [clean, install]
[INFO] ----------------------------------------------------------------------------
[INFO] [clean:clean]
[INFO] Deleting directory /home/continuum/build/work/17/target
[INFO] [plexus:descriptor {execution: default}]
[INFO] [resources:resources]
[INFO] Using default encoding to copy filtered resources.
[WARNING] 
	Artifact junit:junit:jar:3.8.1 retains local scope 'test' overriding broader scope 'compile'
	given by a dependency. If this is not intended, modify or remove the local scope.

[WARNING] 
  This artifact has been relocated to javax.jdo:jdo:2.0-20050809.1515.


[WARNING] 
  This artifact has been relocated to xml-apis:xml-apis:1.0.b2.


[WARNING] 
  This artifact has been relocated to xml-apis:xml-apis:1.0.b2.


[WARNING] POM for: 'incubator-activemq:activemq-core:pom:4.0-M4' does not appear to be valid.
Its will be ignored for artifact resolution.

Reason: Invalid POM (not v4.0.0 modelVersion)


[WARNING] POM for: 'activeio:activeio:pom:2.1' does not appear to be valid. Its will be ignored
for artifact resolution.

Reason: Invalid POM (not v4.0.0 modelVersion)


Downloading: http://cvs.apache.org/repository/org.apache.maven.scm/poms/maven-scm-provider-cvs-1.0-beta-2.pom
[WARNING] Unable to get resource from repository apache (http://cvs.apache.org/repository)
Downloading: http://people.apache.org/~dblevins/maven/org.apache.maven.scm/poms/maven-scm-provider-cvs-1.0-beta-2.pom
[WARNING] Unable to get resource from repository dblevins (http://people.apache.org/~dblevins/maven)
Downloading: http://repo1.maven.org/maven2/org/apache/maven/scm/maven-scm-provider-cvs/1.0-beta-2/maven-scm-provider-cvs-1.0-beta-2.pom
412b downloaded
Downloading: http://cvs.apache.org/repository/org.apache.maven.scm/jars/maven-scm-provider-cvs-1.0-beta-2.jar
[WARNING] Unable to get resource from repository apache (http://cvs.apache.org/repository)
Downloading: http://people.apache.org/~dblevins/maven/org.apache.maven.scm/jars/maven-scm-provider-cvs-1.0-beta-2.jar
[WARNING] Unable to get resource from repository dblevins (http://people.apache.org/~dblevins/maven)
Downloading: http://repo1.maven.org/maven2/org/apache/maven/scm/maven-scm-provider-cvs/1.0-beta-2/maven-scm-provider-cvs-1.0-beta-2.jar
45K downloaded
[INFO] [compiler:compile]
Compiling 36 source files to /home/continuum/build/work/17/target/classes
[INFO] [resources:testResources]
[INFO] Using default encoding to copy filtered resources.
[WARNING] 
  This artifact has been relocated to javax.jdo:jdo:2.0-20050809.1515.


[WARNING] 
  This artifact has been relocated to xml-apis:xml-apis:1.0.b2.


[WARNING] 
  This artifact has been relocated to xml-apis:xml-apis:1.0.b2.


[WARNING] POM for: 'incubator-activemq:activemq-core:pom:4.0-M4' does not appear to be valid.
Its will be ignored for artifact resolution.

Reason: Invalid POM (not v4.0.0 modelVersion)


[WARNING] POM for: 'activeio:activeio:pom:2.1' does not appear to be valid. Its will be ignored
for artifact resolution.

Reason: Invalid POM (not v4.0.0 modelVersion)


[INFO] [compiler:testCompile]
Compiling 10 source files to /home/continuum/build/work/17/target/test-classes
[WARNING] 
  This artifact has been relocated to javax.jdo:jdo:2.0-20050809.1515.


[WARNING] 
  This artifact has been relocated to xml-apis:xml-apis:1.0.b2.


[WARNING] 
  This artifact has been relocated to xml-apis:xml-apis:1.0.b2.


[WARNING] POM for: 'incubator-activemq:activemq-core:pom:4.0-M4' does not appear to be valid.
Its will be ignored for artifact resolution.

Reason: Invalid POM (not v4.0.0 modelVersion)


[WARNING] POM for: 'activeio:activeio:pom:2.1' does not appear to be valid. Its will be ignored
for artifact resolution.

Reason: Invalid POM (not v4.0.0 modelVersion)


[INFO] [surefire:test]
[INFO] Setting reports dir: /home/continuum/build/work/17/target/surefire-reports

-------------------------------------------------------
 T E S T S
-------------------------------------------------------
Jan 23, 2006 5:35:37 AM org.apache.activemq.broker.BrokerService getBroker
INFO: ActiveMQ 4.0-M4 JMS Message Broker (localhost) is starting
Jan 23, 2006 5:35:37 AM org.apache.activemq.broker.BrokerService getBroker
INFO: For help or more information please see: http://www.logicblaze.com
Jan 23, 2006 5:35:39 AM org.apache.activemq.store.jdbc.JDBCPersistenceAdapter createAdapter
INFO: Database driver recognized: [apache_derby_embedded_jdbc_driver]
Jan 23, 2006 5:35:40 AM org.apache.activemq.store.journal.JournalPersistenceAdapter recover
INFO: Journal Recovery Started from: Active Journal: using 2 x 20.0 Megs at: activemq-data/localhost/journal
Jan 23, 2006 5:35:40 AM org.apache.activemq.store.journal.JournalPersistenceAdapter recover
INFO: Journal Recovered: 0 message(s) in transactions recovered.
Jan 23, 2006 5:35:41 AM org.apache.activemq.transport.TransportServerThreadSupport start
INFO: Listening for connections at: tcp://stan.gbuild.org:61616
Jan 23, 2006 5:35:41 AM org.apache.activemq.broker.TransportConnector start
INFO: Accepting connection on: tcp://stan.gbuild.org:61616
Jan 23, 2006 5:35:41 AM org.apache.activemq.broker.BrokerService start
INFO: ActiveMQ JMS Message Broker (localhost) started
[INFO] Client connected: tcp://localhost:61616
[INFO] Continuum Build Agent starting.
[INFO] Continuum Build Agent started and waiting for work.
[INFO] Updating project: id: '10', name 'Shell Project'.
[INFO] Executing: cvs -f -q update -d
[INFO] Working directory: /home/continuum/build/work/17/agent/work/10
[WARNING] Could not find the executable 'ant' in the path '[]'.
[WARNING] Could not find the executable 'maven' in the path '[]'.
[WARNING] Could not find the executable 'mvn' in the path '[]'.
[INFO] Build executors:
[INFO]   maven-1
[INFO]   ant
[INFO]   maven2
[INFO]   shell
[INFO] Updating project 'Shell Project' from checkout.
[WARNING] Executable '/home/continuum/build/work/17/target/it/shell/script.sh'.
[INFO] Arguments: 
[INFO] Working directory: /home/continuum/build/work/17/agent/work/10
[INFO] Exit code: 0
Jan 23, 2006 5:35:42 AM org.apache.activemq.broker.BrokerService stop
INFO: ActiveMQ Message Broker (localhost) is shutting down
Jan 23, 2006 5:35:42 AM org.apache.activemq.broker.BrokerService stop
INFO: ActiveMQ JMS Message Broker (localhost) stopped
Jan 23, 2006 5:35:42 AM org.apache.activemq.broker.BrokerService getBroker
INFO: ActiveMQ 4.0-M4 JMS Message Broker (localhost) is starting
Jan 23, 2006 5:35:42 AM org.apache.activemq.broker.BrokerService getBroker
INFO: For help or more information please see: http://www.logicblaze.com
Jan 23, 2006 5:35:42 AM org.apache.activemq.store.jdbc.JDBCPersistenceAdapter createAdapter
INFO: Database driver recognized: [apache_derby_embedded_jdbc_driver]
Jan 23, 2006 5:35:42 AM org.apache.activemq.store.journal.JournalPersistenceAdapter recover
INFO: Journal Recovery Started from: Active Journal: using 2 x 20.0 Megs at: activemq-data/localhost/journal
Jan 23, 2006 5:35:42 AM org.apache.activemq.store.journal.JournalPersistenceAdapter recover
INFO: Journal Recovered: 0 message(s) in transactions recovered.
Jan 23, 2006 5:35:42 AM org.apache.activemq.transport.TransportServerThreadSupport start
INFO: Listening for connections at: tcp://stan.gbuild.org:61616
Jan 23, 2006 5:35:42 AM org.apache.activemq.broker.TransportConnector start
INFO: Accepting connection on: tcp://stan.gbuild.org:61616
Jan 23, 2006 5:35:42 AM org.apache.activemq.broker.BrokerService start
INFO: ActiveMQ JMS Message Broker (localhost) started
[INFO] Client connected: tcp://localhost:61616
[INFO] Continuum Build Agent starting.
[INFO] Continuum Build Agent started and waiting for work.
[INFO] Checking out project: 'Shell Project', id: '11' to '/home/continuum/build/work/17/agent/work/11'.
[INFO] Working directory: /home/continuum/build/work/17/agent/work/11
[INFO] Command line: svn --non-interactive checkout file:///home/continuum/build/work/17/target/it/svn-root/shell
11
[INFO] Checked out 1 files.
[WARNING] Could not find the executable 'ant' in the path '[]'.
[WARNING] Could not find the executable 'maven' in the path '[]'.
[WARNING] Could not find the executable 'mvn' in the path '[]'.
[INFO] Build executors:
[INFO]   maven-1
[INFO]   ant
[INFO]   maven2
[INFO]   shell
[INFO] Updating project 'Shell Project' from checkout.
[WARNING] Executable '/home/continuum/build/work/17/target/it/shell/script.sh'.
[INFO] Arguments: 
[INFO] Working directory: /home/continuum/build/work/17/agent/work/11
[INFO] Exit code: 0
Jan 23, 2006 5:35:43 AM org.apache.activemq.broker.BrokerService stop
INFO: ActiveMQ Message Broker (localhost) is shutting down
Jan 23, 2006 5:35:43 AM org.apache.activemq.broker.BrokerService stop
INFO: ActiveMQ JMS Message Broker (localhost) stopped
Jan 23, 2006 5:35:43 AM org.apache.activemq.broker.BrokerService getBroker
INFO: ActiveMQ 4.0-M4 JMS Message Broker (localhost) is starting
Jan 23, 2006 5:35:43 AM org.apache.activemq.broker.BrokerService getBroker
INFO: For help or more information please see: http://www.logicblaze.com
Jan 23, 2006 5:35:43 AM org.apache.activemq.store.jdbc.JDBCPersistenceAdapter createAdapter
INFO: Database driver recognized: [apache_derby_embedded_jdbc_driver]
Jan 23, 2006 5:35:43 AM org.apache.activemq.store.journal.JournalPersistenceAdapter recover
INFO: Journal Recovery Started from: Active Journal: using 2 x 20.0 Megs at: activemq-data/localhost/journal
Jan 23, 2006 5:35:43 AM org.apache.activemq.store.journal.JournalPersistenceAdapter recover
INFO: Journal Recovered: 0 message(s) in transactions recovered.
Jan 23, 2006 5:35:43 AM org.apache.activemq.transport.TransportServerThreadSupport start
INFO: Listening for connections at: tcp://stan.gbuild.org:61616
Jan 23, 2006 5:35:43 AM org.apache.activemq.broker.TransportConnector start
INFO: Accepting connection on: tcp://stan.gbuild.org:61616
Jan 23, 2006 5:35:43 AM org.apache.activemq.broker.BrokerService start
INFO: ActiveMQ JMS Message Broker (localhost) started
[INFO] Client connected: tcp://localhost:61616
[INFO] Continuum Build Agent starting.
[INFO] Continuum Build Agent started and waiting for work.
[INFO] Continuum Build Agent starting.
[INFO] Continuum Build Agent started and waiting for work.
[INFO] Message Received ID:stan.gbuild.org-34518-1138023340674-2:2:1:1:1 on ID:stan.gbuild.org-34518-1138023340674-3:3:BUILD.TASKS
[INFO] Message Received ID:stan.gbuild.org-34518-1138023340674-2:2:1:1:2 on ID:stan.gbuild.org-34518-1138023340674-3:3:BUILD.TASKS
[INFO] Executing extention clean-dead-processes pre process
[INFO] Executing extention general-headers pre process
[INFO] Executing extention report-activity pre process
[INFO] Executing extention clean-dead-processes pre process
[INFO] Executing extention general-headers pre process
[INFO] Executing extention report-activity pre process
[INFO] Executing extention build-output pre process
[INFO] Executing extention file-include pre process
[INFO] Executing extention build-output pre process
[INFO] Executing extention file-include pre process
[INFO] Updating project: id: '12', name 'Shell Project'.
[INFO] Updating project: id: '12', name 'Shell Project'.
[INFO] Executing: cvs -f -q update -d
[INFO] Working directory: /home/continuum/build/work/17/agent/work/12
[INFO] Executing: cvs -f -q update -d
[INFO] Working directory: /home/continuum/build/work/17/agent/work/12
[WARNING] Could not find the executable 'ant' in the path '[]'.
[WARNING] Could not find the executable 'maven' in the path '[]'.
[WARNING] Could not find the executable 'mvn' in the path '[]'.
[INFO] Build executors:
[INFO]   maven-1
[INFO]   ant
[INFO]   maven2
[INFO]   shell
[INFO] Updating project 'Shell Project' from checkout.
[INFO] Updating project 'Shell Project' from checkout.
[WARNING] Executable '/home/continuum/build/work/17/target/it/shell/script.sh'.
[INFO] Arguments: two
[INFO] Working directory: /home/continuum/build/work/17/agent/work/12
[INFO] Exit code: 0
[WARNING] Executable '/home/continuum/build/work/17/target/it/shell/script.sh'.
[INFO] Arguments: one
[INFO] Working directory: /home/continuum/build/work/17/agent/work/12
[INFO] Executing extention clean-dead-processes post process
[INFO] Exit code: 0
[INFO] Executing extention clean-dead-processes post process
[INFO] Executing extention general-headers post process
[WARNING] replaced projectId = 12
[WARNING] replaced buildDefinitionId = 1
[INFO] Executing extention report-activity post process
[INFO] Executing extention general-headers post process
[WARNING] replaced projectId = 12
[WARNING] replaced buildDefinitionId = 0
[INFO] Executing extention report-activity post process
[INFO] Executing extention build-output post process
[INFO] Executing extention build-output post process
[INFO] Including 24 - /home/continuum/build/work/17/agent/output/12/0.log.txt
[INFO] Executing extention file-include post process
[INFO] Including 24 - /home/continuum/build/work/17/agent/output/12/0.log.txt
[INFO] Executing extention file-include post process
[INFO] Finished processing ID:stan.gbuild.org-34518-1138023340674-2:2:1:1:2
[INFO] Results sent to BUILD.RESULTS
[INFO] Message Received ID:stan.gbuild.org-34518-1138023340674-2:2:1:1:4 on ID:stan.gbuild.org-34518-1138023340674-3:3:BUILD.TASKS
[INFO] Finished processing ID:stan.gbuild.org-34518-1138023340674-2:2:1:1:1
[INFO] Results sent to BUILD.RESULTS
[INFO] [INFO] Executing extention clean-dead-processes pre process
[INFO] Executing extention general-headers pre process
[INFO] Executing extention report-activity pre process
Message Received ID:stan.gbuild.org-34518-1138023340674-2:2:1:1:3 on ID:stan.gbuild.org-34518-1138023340674-3:3:BUILD.TASKS
[INFO] Executing extention build-output pre process
[INFO] Executing extention file-include pre process
[INFO] Updating project: id: '12', name 'Shell Project'.
[INFO] Executing: cvs -f -q update -d
[INFO] Working directory: /home/continuum/build/work/17/agent/work/12
[INFO] Executing extention clean-dead-processes pre process
[INFO] Executing extention general-headers pre process
[INFO] Executing extention report-activity pre process
[INFO] Updating project 'Shell Project' from checkout.
[WARNING] Executable '/home/continuum/build/work/17/target/it/shell/script.sh'.
[INFO] Arguments: four
[INFO] Working directory: /home/continuum/build/work/17/agent/work/12
[RESULT] Shell Project : two : 1
[INFO] Executing extention build-output pre process
[INFO] Executing extention file-include pre process
[INFO] Updating project: id: '12', name 'Shell Project'.
[INFO] Executing: cvs -f -q update -d
[INFO] Working directory: /home/continuum/build/work/17/agent/work/12
[RESULT] Shell Project : one : 1
[INFO] Updating project 'Shell Project' from checkout.
[INFO] Exit code: 0
[WARNING] Executable '/home/continuum/build/work/17/target/it/shell/script.sh'.
[INFO] Arguments: three
[INFO] Working directory: /home/continuum/build/work/17/agent/work/12
[INFO] Executing extention clean-dead-processes post process
[INFO] Exit code: 0
[INFO] Executing extention clean-dead-processes post process
[INFO] Executing extention general-headers post process
[WARNING] replaced projectId = 12
[WARNING] replaced buildDefinitionId = 3
[INFO] Executing extention report-activity post process
[INFO] Executing extention build-output post process
[INFO] Including 26 - /home/continuum/build/work/17/agent/output/12/0.log.txt
[INFO] Executing extention file-include post process
[INFO] Finished processing ID:stan.gbuild.org-34518-1138023340674-2:2:1:1:4
[INFO] Results sent to BUILD.RESULTS
[INFO] Message Received ID:stan.gbuild.org-34518-1138023340674-2:2:1:1:5 on ID:stan.gbuild.org-34518-1138023340674-3:3:BUILD.TASKS
[INFO] Executing extention general-headers post process
[WARNING] replaced projectId = 12
[WARNING] replaced buildDefinitionId = 2
[INFO] Executing extention report-activity post process
[INFO] Executing extention clean-dead-processes pre process
[INFO] Executing extention general-headers pre process
[INFO] Executing extention report-activity pre process
[INFO] Executing extention build-output post process
[INFO] Including 26 - /home/continuum/build/work/17/agent/output/12/0.log.txt
[INFO] Executing extention file-include post process
[INFO] Executing extention build-output pre process
[INFO] Executing extention file-include pre process
[INFO] Finished processing ID:stan.gbuild.org-34518-1138023340674-2:2:1:1:3
[INFO] Updating project: id: '12', name 'Shell Project'.
[INFO] Results sent to BUILD.RESULTS
[INFO] Executing: cvs -f -q update -d
[INFO] Working directory: /home/continuum/build/work/17/agent/work/12
[INFO] Message Received ID:stan.gbuild.org-34518-1138023340674-2:2:1:1:6 on ID:stan.gbuild.org-34518-1138023340674-3:3:BUILD.TASKS
[INFO] Executing extention clean-dead-processes pre process
[INFO] Executing extention general-headers pre process
[INFO] Executing extention report-activity pre process
[INFO] Executing extention build-output pre process
[INFO] Executing extention file-include pre process
[INFO] Updating project: id: '12', name 'Shell Project'.
[INFO] Updating project 'Shell Project' from checkout.
[WARNING] Executable '/home/continuum/build/work/17/target/it/shell/script.sh'.
[INFO] Arguments: five
[INFO] Working directory: /home/continuum/build/work/17/agent/work/12
[INFO] Executing: cvs -f -q update -d
[INFO] Working directory: /home/continuum/build/work/17/agent/work/12
[RESULT] Shell Project : four : 1
[RESULT] Shell Project : three : 1
[INFO] Updating project 'Shell Project' from checkout.
[INFO] Exit code: 0
[WARNING] Executable '/home/continuum/build/work/17/target/it/shell/script.sh'.
[INFO] Arguments: six
[INFO] Working directory: /home/continuum/build/work/17/agent/work/12
[INFO] Executing extention clean-dead-processes post process
[INFO] Exit code: 0
[INFO] Executing extention clean-dead-processes post process
[INFO] Executing extention general-headers post process
[WARNING] replaced projectId = 12
[WARNING] replaced buildDefinitionId = 4
[INFO] Executing extention report-activity post process
[INFO] Executing extention build-output post process
[INFO] Including 24 - /home/continuum/build/work/17/agent/output/12/0.log.txt
[INFO] Executing extention file-include post process
[INFO] Finished processing ID:stan.gbuild.org-34518-1138023340674-2:2:1:1:5
[INFO] Results sent to BUILD.RESULTS
[INFO] Message Received ID:stan.gbuild.org-34518-1138023340674-2:2:1:1:7 on ID:stan.gbuild.org-34518-1138023340674-3:3:BUILD.TASKS
[INFO] Executing extention clean-dead-processes pre process
[INFO] Executing extention general-headers pre process
[INFO] Executing extention report-activity pre process
[INFO] Executing extention build-output pre process
[INFO] Executing extention file-include pre process
[INFO] Updating project: id: '12', name 'Shell Project'.
[INFO] Executing: cvs -f -q update -d
[INFO] Working directory: /home/continuum/build/work/17/agent/work/12
[INFO] Executing extention general-headers post process
[WARNING] replaced projectId = 12
[INFO] Updating project 'Shell Project' from checkout.
[WARNING] replaced buildDefinitionId = 5
[INFO] Executing extention report-activity post process
[WARNING] Executable '/home/continuum/build/work/17/target/it/shell/script.sh'.
[INFO] Arguments: seven
[INFO] Working directory: /home/continuum/build/work/17/agent/work/12
[INFO] Executing extention build-output post process
[INFO] Including 20 - /home/continuum/build/work/17/agent/output/12/0.log.txt
[INFO] Executing extention file-include post process
[INFO] Finished processing ID:stan.gbuild.org-34518-1138023340674-2:2:1:1:6
[INFO] Results sent to BUILD.RESULTS
[INFO] Message Received ID:stan.gbuild.org-34518-1138023340674-2:2:1:1:8 on ID:stan.gbuild.org-34518-1138023340674-3:3:BUILD.TASKS
[INFO] Executing extention clean-dead-processes pre process
[INFO] Executing extention general-headers pre process
[INFO] Executing extention report-activity pre process
[RESULT] Shell Project : five : 1
[INFO] Executing extention build-output pre process
[INFO] Executing extention file-include pre process
[INFO] Updating project: id: '12', name 'Shell Project'.
[INFO] Executing: cvs -f -q update -d
[INFO] Working directory: /home/continuum/build/work/17/agent/work/12
[RESULT] Shell Project : six : 1
[INFO] Exit code: 0
[INFO] Executing extention clean-dead-processes post process
[INFO] Updating project 'Shell Project' from checkout.
[WARNING] Executable '/home/continuum/build/work/17/target/it/shell/script.sh'.
[INFO] Arguments: eight
[INFO] Working directory: /home/continuum/build/work/17/agent/work/12
[INFO] Executing extention general-headers post process
[WARNING] replaced projectId = 12
[WARNING] replaced buildDefinitionId = 6
[INFO] Executing extention report-activity post process
[INFO] Executing extention build-output post process
[INFO] Including 20 - /home/continuum/build/work/17/agent/output/12/0.log.txt
[INFO] Executing extention file-include post process
[INFO] Finished processing ID:stan.gbuild.org-34518-1138023340674-2:2:1:1:7
[INFO] Results sent to BUILD.RESULTS
[INFO] Message Received ID:stan.gbuild.org-34518-1138023340674-2:2:1:1:9 on ID:stan.gbuild.org-34518-1138023340674-3:3:BUILD.TASKS
[INFO] Executing extention clean-dead-processes pre process
[INFO] Executing extention general-headers pre process
[INFO] Executing extention report-activity pre process
[INFO] Executing extention build-output pre process
[INFO] Executing extention file-include pre process
[INFO] Exit code: 0
[INFO] Updating project: id: '12', name 'Shell Project'.
[INFO] Executing extention clean-dead-processes post process
[INFO] Executing: cvs -f -q update -d
[INFO] Working directory: /home/continuum/build/work/17/agent/work/12
[INFO] Updating project 'Shell Project' from checkout.
[WARNING] Executable '/home/continuum/build/work/17/target/it/shell/script.sh'.
[INFO] Arguments: nine
[INFO] Working directory: /home/continuum/build/work/17/agent/work/12
[INFO] Executing extention general-headers post process
[WARNING] replaced projectId = 12
[WARNING] replaced buildDefinitionId = 7
[INFO] Executing extention report-activity post process
[INFO] Exit code: 0
[INFO] Executing extention build-output post process
[RESULT] Shell Project : seven : 1
[INFO] Executing extention clean-dead-processes post process
[INFO] Including 25 - /home/continuum/build/work/17/agent/output/12/0.log.txt
[INFO] Executing extention file-include post process
[INFO] Finished processing ID:stan.gbuild.org-34518-1138023340674-2:2:1:1:8
[INFO] Results sent to BUILD.RESULTS
[INFO] Message Received ID:stan.gbuild.org-34518-1138023340674-2:2:1:1:10 on ID:stan.gbuild.org-34518-1138023340674-3:3:BUILD.TASKS
[INFO] Executing extention clean-dead-processes pre process
[INFO] Executing extention general-headers pre process
[INFO] Executing extention report-activity pre process
[INFO] Executing extention build-output pre process
[INFO] Executing extention file-include pre process
[INFO] Updating project: id: '12', name 'Shell Project'.
[INFO] Executing: cvs -f -q update -d
[INFO] Working directory: /home/continuum/build/work/17/agent/work/12
[INFO] Executing extention general-headers post process
[WARNING] replaced projectId = 12
[WARNING] replaced buildDefinitionId = 8
[INFO] Executing extention report-activity post process
[INFO] Updating project 'Shell Project' from checkout.
[WARNING] Executable '/home/continuum/build/work/17/target/it/shell/script.sh'.
[INFO] Arguments: ten
[INFO] Working directory: /home/continuum/build/work/17/agent/work/12
[RESULT] Shell Project : eight : 1
[INFO] Executing extention build-output post process
[INFO] Including 25 - /home/continuum/build/work/17/agent/output/12/0.log.txt
[INFO] Executing extention file-include post process
[INFO] Finished processing ID:stan.gbuild.org-34518-1138023340674-2:2:1:1:9
[INFO] Results sent to BUILD.RESULTS
[INFO] Message Received ID:stan.gbuild.org-34518-1138023340674-2:2:1:1:11 on ID:stan.gbuild.org-34518-1138023340674-3:3:BUILD.TASKS
[INFO] Executing extention clean-dead-processes pre process
[INFO] Executing extention general-headers pre process
[INFO] Executing extention report-activity pre process
[INFO] Executing extention build-output pre process
[INFO] Executing extention file-include pre process
[INFO] Updating project: id: '12', name 'Shell Project'.
[INFO] Executing: cvs -f -q update -d
[INFO] Working directory: /home/continuum/build/work/17/agent/work/12
[INFO] Exit code: 0
[INFO] Executing extention clean-dead-processes post process
[INFO] Updating project 'Shell Project' from checkout.
[WARNING] Executable '/home/continuum/build/work/17/target/it/shell/script.sh'.
[INFO] Arguments: eleven
[INFO] Working directory: /home/continuum/build/work/17/agent/work/12
[RESULT] Shell Project : nine : 1
[INFO] Executing extention general-headers post process
[WARNING] replaced projectId = 12
[WARNING] replaced buildDefinitionId = 9
[INFO] Executing extention report-activity post process
[INFO] Executing extention build-output post process
[INFO] Including 20 - /home/continuum/build/work/17/agent/output/12/0.log.txt
[INFO] Executing extention file-include post process
[INFO] Finished processing ID:stan.gbuild.org-34518-1138023340674-2:2:1:1:10
[INFO] Exit code: 0
[INFO] Executing extention clean-dead-processes post process
[RESULT] Shell Project : ten : 1
[INFO] Results sent to BUILD.RESULTS
[INFO] Message Received ID:stan.gbuild.org-34518-1138023340674-2:2:1:1:12 on ID:stan.gbuild.org-34518-1138023340674-3:3:BUILD.TASKS
[INFO] Executing extention clean-dead-processes pre process
[INFO] Executing extention general-headers pre process
[INFO] Executing extention report-activity pre process
[INFO] Executing extention build-output pre process
[INFO] Executing extention file-include pre process
[INFO] Updating project: id: '12', name 'Shell Project'.
[INFO] Executing: cvs -f -q update -d
[INFO] Working directory: /home/continuum/build/work/17/agent/work/12
[INFO] Executing extention general-headers post process
[WARNING] replaced projectId = 12
[WARNING] replaced buildDefinitionId = 10
[INFO] Executing extention report-activity post process
[INFO] Executing extention build-output post process
[INFO] Including 27 - /home/continuum/build/work/17/agent/output/12/0.log.txt
[INFO] Executing extention file-include post process
[INFO] Updating project 'Shell Project' from checkout.
[WARNING] Executable '/home/continuum/build/work/17/target/it/shell/script.sh'.
[INFO] Arguments: twelve
[INFO] Working directory: /home/continuum/build/work/17/agent/work/12
[INFO] Finished processing ID:stan.gbuild.org-34518-1138023340674-2:2:1:1:11
[INFO] Results sent to BUILD.RESULTS
[RESULT] Shell Project : eleven : 1
[INFO] Exit code: 0
[INFO] Executing extention clean-dead-processes post process
[INFO] Executing extention general-headers post process
[WARNING] replaced projectId = 12
[WARNING] replaced buildDefinitionId = 11
[INFO] Executing extention report-activity post process
[INFO] Executing extention build-output post process
[INFO] Including 27 - /home/continuum/build/work/17/agent/output/12/0.log.txt
[INFO] Executing extention file-include post process
[INFO] Finished processing ID:stan.gbuild.org-34518-1138023340674-2:2:1:1:12
[INFO] Results sent to BUILD.RESULTS
[RESULT] Shell Project : twelve : 1
Jan 23, 2006 5:35:44 AM org.apache.activemq.broker.BrokerService stop
INFO: ActiveMQ Message Broker (localhost) is shutting down
Jan 23, 2006 5:35:44 AM org.apache.activemq.broker.BrokerService stop
INFO: ActiveMQ JMS Message Broker (localhost) stopped
[surefire] Running org.apache.geronimo.gbuild.agent.ContinuumBuildAgentTest
[surefire] Tests run: 3, Failures: 0, Errors: 0, Time elapsed: 7.212 sec
[info] include-writer - Include files will be written to /home/continuum/build/work/17/target
[debug] include-writer - Pattern ^include.*
[debug] include-writer - Found include pattern include.hello
[info] include-writer - Writing 6 characters to /home/continuum/build/work/17/target/include-test/one.properties
[surefire] Running org.apache.geronimo.gbuild.agent.WriteIncludeFileExtentionTest
[surefire] Tests run: 1, Failures: 0, Errors: 0, Time elapsed: 0.007 sec
[debug] 2273946 - Doing initial scan of /tmp/dirscan44791
[debug] 2273946 - File Discovered: /tmp/dirscan44791/aaa
[info] 2273946 - New File: /tmp/dirscan44791/aaa
[debug] 2273946 - File Changing: /tmp/dirscan44791/aaa
[info] 2273946 - Updated File: /tmp/dirscan44791/aaa
[info] 2273946 - File removed: /tmp/dirscan44791/aaa
[debug] 2273946 - File Discovered: /tmp/dirscan44791/aaa
[info] 2273946 - New File: /tmp/dirscan44791/aaa
[surefire] Running org.apache.geronimo.gbuild.agent.DirectoryMonitorTest
[surefire] Tests run: 1, Failures: 0, Errors: 0, Time elapsed: 0.011 sec
[surefire] Running org.apache.geronimo.gbuild.agent.StringTemplateTest
[surefire] Tests run: 1, Failures: 0, Errors: 0, Time elapsed: 0.001 sec
[surefire] Running org.apache.geronimo.gbuild.agent.KillProcessesExtensionTest
[surefire] Tests run: 1, Failures: 1, Errors: 0, Time elapsed: 0.051 sec <<<<<<<<
FAILURE !! 

Results :
[surefire] Tests run: 7, Failures: 1, Errors: 0

[INFO] ----------------------------------------------------------------------------
[ERROR] BUILD ERROR
[INFO] ----------------------------------------------------------------------------
[INFO] There are some test failure.
[INFO] ----------------------------------------------------------------------------
[INFO] For more information, run Maven with the -e switch
[INFO] ----------------------------------------------------------------------------
[INFO] Total time: 28 seconds
[INFO] Finished at: Mon Jan 23 05:35:44 PST 2006
[INFO] Final Memory: 12M/24M
[INFO] ----------------------------------------------------------------------------

****************************************************************************



Mime
View raw message