geronimo-scm mailing list archives

Site index · List index
Message view « Date » · « Thread »
Top « Date » · « Thread »
From continuum <contin...@stan.gbuild.org>
Subject [continuum] BUILD FAILURE: GBuild Agent Application
Date Fri, 13 Jan 2006 05:26:43 GMT
Online report : http://ci.gbuild.org/continuum/target/ProjectBuild.vm/view/ProjectBuild/id/20/buildId/744
Build statistics:
  State: Failed
  Previous Build: No previous build.
  Started at: Thu, 12 Jan 2006 21:24:43 -0800
  Finished at: Thu, 12 Jan 2006 21:26:43 -0800
  Total time: 1m 59s
  Build Trigger: Forced
  Exit code: 1
  Building machine hostname: stan.gbuild.org
  Operating system : Linux(unknown)
  Java version : 1.4.2_08(Sun Microsystems Inc.)

Changes
      No files changed
  
****************************************************************************
Output:
****************************************************************************
[INFO] Scanning for projects...
[INFO] snapshot org.apache.geronimo.gbuild:gbuild-parent:1.0-SNAPSHOT: checking for updates
from apache.snapshots
[INFO] ----------------------------------------------------------------------------
[INFO] Building GBuild Agent Application
[INFO]    task-segment: [clean, install]
[INFO] ----------------------------------------------------------------------------
[ERROR] Nonexistent component: org.apache.maven.lifecycle.mapping.LifecycleMappingplexus-application
[INFO] artifact org.apache.maven.plugins:maven-assembly-plugin: checking for updates from
central
Downloading: http://repo1.maven.org/maven2/org/apache/maven/plugins/maven-assembly-plugin/2.0/maven-assembly-plugin-2.0.pom
1K downloaded
Downloading: http://repo1.maven.org/maven2/org/apache/maven/plugins/maven-assembly-plugin/2.0/maven-assembly-plugin-2.0.jar
35K downloaded
[INFO] [clean:clean]
[INFO] [plexus:descriptor {execution: default}]
[WARNING] Specified source directory isn't a directory: '/home/continuum/build/work/20/src/main/java'.
[INFO] snapshot org.apache.maven.scm:maven-scm-provider-cvs:1.0-beta-1-SNAPSHOT: checking
for updates from apache.snapshots
[INFO] snapshot org.apache.maven.scm:maven-scm-providers:1.0-beta-1-SNAPSHOT: checking for
updates from apache.snapshots
[INFO] snapshot org.apache.maven.scm:maven-scm:1.0-beta-1-SNAPSHOT: checking for updates from
apache.snapshots
[INFO] snapshot org.apache.maven.scm:maven-scm-api:1.0-beta-1-SNAPSHOT: checking for updates
from apache.snapshots
[WARNING] 
	Artifact junit:junit:jar:3.8.1 retains local scope 'test' overriding broader scope 'compile'
	given by a dependency. If this is not intended, modify or remove the local scope.

Downloading: http://cvs.apache.org/repository/org.codehaus.plexus/poms/plexus-log4j-logging-1.1-alpha-1.pom
[WARNING] Unable to get resource from repository apache.snapshots (http://cvs.apache.org/repository)
Downloading: http://repo1.maven.org/maven2/org/codehaus/plexus/plexus-log4j-logging/1.1-alpha-1/plexus-log4j-logging-1.1-alpha-1.pom
769b downloaded
Downloading: http://cvs.apache.org/repository/org.codehaus.plexus/poms/plexus-logging-1.0.2.pom
[WARNING] Unable to get resource from repository apache.snapshots (http://cvs.apache.org/repository)
Downloading: http://repo1.maven.org/maven2/org/codehaus/plexus/plexus-logging/1.0.2/plexus-logging-1.0.2.pom
737b downloaded
Downloading: http://cvs.apache.org/repository/log4j/poms/log4j-1.2.8.pom
[WARNING] Unable to get resource from repository apache.snapshots (http://cvs.apache.org/repository)
Downloading: http://repo1.maven.org/maven2/log4j/log4j/1.2.8/log4j-1.2.8.pom
145b downloaded
Downloading: http://cvs.apache.org/repository/org.codehaus.plexus/poms/plexus-notification-1.0-alpha-5.pom
[WARNING] Unable to get resource from repository apache.snapshots (http://cvs.apache.org/repository)
Downloading: http://repo1.maven.org/maven2/org/codehaus/plexus/plexus-notification/1.0-alpha-5/plexus-notification-1.0-alpha-5.pom
409b downloaded
Downloading: http://cvs.apache.org/repository/org.codehaus.plexus/poms/plexus-formica-1.0-beta-7.pom
[WARNING] Unable to get resource from repository apache.snapshots (http://cvs.apache.org/repository)
Downloading: http://repo1.maven.org/maven2/org/codehaus/plexus/plexus-formica/1.0-beta-7/plexus-formica-1.0-beta-7.pom
854b downloaded
Downloading: http://cvs.apache.org/repository/org.codehaus.plexus/poms/plexus-i18n-1.0-beta-6.pom
[WARNING] Unable to get resource from repository apache.snapshots (http://cvs.apache.org/repository)
Downloading: http://repo1.maven.org/maven2/org/codehaus/plexus/plexus-i18n/1.0-beta-6/plexus-i18n-1.0-beta-6.pom
771b downloaded
Downloading: http://cvs.apache.org/repository/oro/poms/oro-2.0.6.pom
[WARNING] Unable to get resource from repository apache.snapshots (http://cvs.apache.org/repository)
Downloading: http://repo1.maven.org/maven2/oro/oro/2.0.6/oro-2.0.6.pom
141b downloaded
Downloading: http://cvs.apache.org/repository/ognl/poms/ognl-2.6.7.pom
[WARNING] Unable to get resource from repository apache.snapshots (http://cvs.apache.org/repository)
Downloading: http://repo1.maven.org/maven2/ognl/ognl/2.6.7/ognl-2.6.7.pom
1K downloaded
[INFO] snapshot org.apache.maven.scm:maven-scm-manager-plexus:1.0-beta-1-SNAPSHOT: checking
for updates from apache.snapshots
[INFO] snapshot org.apache.maven.scm:maven-scm-manager-plexus:1.0-beta-1-SNAPSHOT: checking
for updates from snapshots
Downloading: http://snapshots.maven.codehaus.org/maven2/org/apache/maven/scm/maven-scm-manager-plexus/1.0-beta-1-SNAPSHOT/maven-scm-manager-plexus-1.0-beta-1-20051107.151910-1.pom
641b downloaded
[INFO] snapshot org.apache.maven.scm:maven-scm-managers:1.0-beta-1-SNAPSHOT: checking for
updates from apache.snapshots
[INFO] snapshot org.apache.maven.scm:maven-scm-managers:1.0-beta-1-SNAPSHOT: checking for
updates from snapshots
Downloading: http://snapshots.maven.codehaus.org/maven2/org/apache/maven/scm/maven-scm-managers/1.0-beta-1-SNAPSHOT/maven-scm-managers-1.0-beta-1-20051107.151820-2.pom
654b downloaded
Downloading: http://cvs.apache.org/repository/org.apache.maven/poms/maven-project-2.0-1.pom
[WARNING] Unable to get resource from repository apache.snapshots (http://cvs.apache.org/repository)
Downloading: http://repo1.maven.org/maven2/org/apache/maven/maven-project/2.0-1/maven-project-2.0-1.pom
1K downloaded
Downloading: http://cvs.apache.org/repository/quartz/poms/quartz-1.4.5.pom
[WARNING] Unable to get resource from repository apache.snapshots (http://cvs.apache.org/repository)
Downloading: http://repo1.maven.org/maven2/quartz/quartz/1.4.5/quartz-1.4.5.pom
146b downloaded
Downloading: http://cvs.apache.org/repository/org.codehaus.plexus/poms/plexus-taskqueue-1.0-alpha-3.pom
[WARNING] Unable to get resource from repository apache.snapshots (http://cvs.apache.org/repository)
Downloading: http://repo1.maven.org/maven2/org/codehaus/plexus/plexus-taskqueue/1.0-alpha-3/plexus-taskqueue-1.0-alpha-3.pom
589b downloaded
[INFO] snapshot org.apache.maven.scm:maven-scm-provider-svn:1.0-beta-1-SNAPSHOT: checking
for updates from apache.snapshots
[INFO] snapshot org.apache.maven.scm:maven-scm-provider-svn:1.0-beta-1-SNAPSHOT: checking
for updates from snapshots
Downloading: http://snapshots.maven.codehaus.org/maven2/org/apache/maven/scm/maven-scm-provider-svn/1.0-beta-1-SNAPSHOT/maven-scm-provider-svn-1.0-beta-1-20051114.124603-4.pom
615b downloaded
Downloading: http://cvs.apache.org/repository/org.codehaus.plexus/poms/plexus-jdo2-1.0-alpha-3.pom
[WARNING] Unable to get resource from repository apache.snapshots (http://cvs.apache.org/repository)
Downloading: http://repo1.maven.org/maven2/org/codehaus/plexus/plexus-jdo2/1.0-alpha-3/plexus-jdo2-1.0-alpha-3.pom
1K downloaded
Downloading: http://cvs.apache.org/repository/jdo/poms/jdo-2.0-snapshot4.pom
[WARNING] Unable to get resource from repository apache.snapshots (http://cvs.apache.org/repository)
Downloading: http://repo1.maven.org/maven2/jdo/jdo/2.0-snapshot4/jdo-2.0-snapshot4.pom
399b downloaded
[WARNING] 
  This artifact has been relocated to javax.jdo:jdo:2.0-20050809.1515.


Downloading: http://cvs.apache.org/repository/javax.jdo/poms/jdo-2.0-20050809.1515.pom
[WARNING] Unable to get resource from repository apache.snapshots (http://cvs.apache.org/repository)
Downloading: http://repo1.maven.org/maven2/javax/jdo/jdo/2.0-20050809.1515/jdo-2.0-20050809.1515.pom
401b downloaded
Downloading: http://cvs.apache.org/repository/org.codehaus.plexus/poms/plexus-action-1.0-alpha-6.pom
[WARNING] Unable to get resource from repository apache.snapshots (http://cvs.apache.org/repository)
Downloading: http://repo1.maven.org/maven2/org/codehaus/plexus/plexus-action/1.0-alpha-6/plexus-action-1.0-alpha-6.pom
766b downloaded
Downloading: http://cvs.apache.org/repository/org.codehaus.plexus/poms/plexus-mail-sender-api-1.0-alpha-3.pom
[WARNING] Unable to get resource from repository apache.snapshots (http://cvs.apache.org/repository)
Downloading: http://repo1.maven.org/maven2/org/codehaus/plexus/plexus-mail-sender-api/1.0-alpha-3/plexus-mail-sender-api-1.0-alpha-3.pom
412b downloaded
Downloading: http://cvs.apache.org/repository/org.codehaus.plexus/poms/plexus-mail-sender-1.0-alpha-3.pom
[WARNING] Unable to get resource from repository apache.snapshots (http://cvs.apache.org/repository)
Downloading: http://repo1.maven.org/maven2/org/codehaus/plexus/plexus-mail-sender/1.0-alpha-3/plexus-mail-sender-1.0-alpha-3.pom
451b downloaded
Downloading: http://cvs.apache.org/repository/org.apache.maven/poms/maven-artifact-2.0-1.pom
[WARNING] Unable to get resource from repository apache.snapshots (http://cvs.apache.org/repository)
Downloading: http://repo1.maven.org/maven2/org/apache/maven/maven-artifact/2.0-1/maven-artifact-2.0-1.pom
725b downloaded
Downloading: http://cvs.apache.org/repository/jpox/poms/jpox-1.1.0-beta-4.pom
[WARNING] Unable to get resource from repository apache.snapshots (http://cvs.apache.org/repository)
Downloading: http://repo1.maven.org/maven2/jpox/jpox/1.1.0-beta-4/jpox-1.1.0-beta-4.pom
2K downloaded
Downloading: http://cvs.apache.org/repository/javax.transaction/poms/jta-1.0.1B.pom
[WARNING] Unable to get resource from repository apache.snapshots (http://cvs.apache.org/repository)
Downloading: http://repo1.maven.org/maven2/javax/transaction/jta/1.0.1B/jta-1.0.1B.pom
515b downloaded
Downloading: http://cvs.apache.org/repository/commons-collections/poms/commons-collections-3.1.pom
[WARNING] Unable to get resource from repository apache.snapshots (http://cvs.apache.org/repository)
Downloading: http://repo1.maven.org/maven2/commons-collections/commons-collections/3.1/commons-collections-3.1.pom
5K downloaded
Downloading: http://cvs.apache.org/repository/javax.resource/poms/connector-1.0.pom
[WARNING] Unable to get resource from repository apache.snapshots (http://cvs.apache.org/repository)
Downloading: http://repo1.maven.org/maven2/javax/resource/connector/1.0/connector-1.0.pom
615b downloaded
Downloading: http://cvs.apache.org/repository/jpox/poms/jpox-dbcp-1.1.0-beta-4.pom
[WARNING] Unable to get resource from repository apache.snapshots (http://cvs.apache.org/repository)
Downloading: http://repo1.maven.org/maven2/jpox/jpox-dbcp/1.1.0-beta-4/jpox-dbcp-1.1.0-beta-4.pom
1K downloaded
[WARNING] 
  This artifact has been relocated to xml-apis:xml-apis:1.0.b2.


[WARNING] 
  This artifact has been relocated to xml-apis:xml-apis:1.0.b2.


Downloading: http://cvs.apache.org/repository/org.apache.maven/poms/maven-settings-2.0.pom
[WARNING] Unable to get resource from repository apache.snapshots (http://cvs.apache.org/repository)
Downloading: http://repo1.maven.org/maven2/org/apache/maven/maven-settings/2.0/maven-settings-2.0.pom
1K downloaded
Downloading: http://cvs.apache.org/repository/org.apache.maven/poms/maven-core-2.0.pom
[WARNING] Unable to get resource from repository apache.snapshots (http://cvs.apache.org/repository)
Downloading: http://repo1.maven.org/maven2/org/apache/maven/maven-core/2.0/maven-core-2.0.pom
5K downloaded
Downloading: http://cvs.apache.org/repository/org.apache.maven/poms/maven-plugin-parameter-documenter-2.0.pom
[WARNING] Unable to get resource from repository apache.snapshots (http://cvs.apache.org/repository)
Downloading: http://repo1.maven.org/maven2/org/apache/maven/maven-plugin-parameter-documenter/2.0/maven-plugin-parameter-documenter-2.0.pom
1K downloaded
Downloading: http://cvs.apache.org/repository/org.apache.maven/poms/maven-error-diagnostics-2.0.pom
[WARNING] Unable to get resource from repository apache.snapshots (http://cvs.apache.org/repository)
Downloading: http://repo1.maven.org/maven2/org/apache/maven/maven-error-diagnostics/2.0/maven-error-diagnostics-2.0.pom
812b downloaded
Downloading: http://cvs.apache.org/repository/org.apache.maven/poms/maven-monitor-2.0.pom
[WARNING] Unable to get resource from repository apache.snapshots (http://cvs.apache.org/repository)
Downloading: http://repo1.maven.org/maven2/org/apache/maven/maven-monitor/2.0/maven-monitor-2.0.pom
400b downloaded
Downloading: http://cvs.apache.org/repository/org.codehaus.plexus/poms/plexus-interactivity-api-1.0-alpha-4.pom
[WARNING] Unable to get resource from repository apache.snapshots (http://cvs.apache.org/repository)
Downloading: http://repo1.maven.org/maven2/org/codehaus/plexus/plexus-interactivity-api/1.0-alpha-4/plexus-interactivity-api-1.0-alpha-4.pom
6K downloaded
Downloading: http://cvs.apache.org/repository/org.apache.maven.wagon/poms/wagon-http-lightweight-1.0-alpha-5.pom
[WARNING] Unable to get resource from repository apache.snapshots (http://cvs.apache.org/repository)
Downloading: http://repo1.maven.org/maven2/org/apache/maven/wagon/wagon-http-lightweight/1.0-alpha-5/wagon-http-lightweight-1.0-alpha-5.pom
5K downloaded
Downloading: http://cvs.apache.org/repository/org.apache.maven.wagon/poms/wagon-file-1.0-alpha-5.pom
[WARNING] Unable to get resource from repository apache.snapshots (http://cvs.apache.org/repository)
Downloading: http://repo1.maven.org/maven2/org/apache/maven/wagon/wagon-file/1.0-alpha-5/wagon-file-1.0-alpha-5.pom
5K downloaded
Downloading: http://cvs.apache.org/repository/org.apache.maven/poms/maven-plugin-descriptor-2.0.pom
[WARNING] Unable to get resource from repository apache.snapshots (http://cvs.apache.org/repository)
Downloading: http://repo1.maven.org/maven2/org/apache/maven/maven-plugin-descriptor/2.0/maven-plugin-descriptor-2.0.pom
1K downloaded
Downloading: http://cvs.apache.org/repository/commons-cli/poms/commons-cli-1.0.pom
[WARNING] Unable to get resource from repository apache.snapshots (http://cvs.apache.org/repository)
Downloading: http://repo1.maven.org/maven2/commons-cli/commons-cli/1.0/commons-cli-1.0.pom
2K downloaded
Downloading: http://cvs.apache.org/repository/org.apache.maven.wagon/poms/wagon-ssh-1.0-alpha-5.pom
[WARNING] Unable to get resource from repository apache.snapshots (http://cvs.apache.org/repository)
Downloading: http://repo1.maven.org/maven2/org/apache/maven/wagon/wagon-ssh/1.0-alpha-5/wagon-ssh-1.0-alpha-5.pom
6K downloaded
Downloading: http://cvs.apache.org/repository/com.jcraft/poms/jsch-0.1.23.pom
[WARNING] Unable to get resource from repository apache.snapshots (http://cvs.apache.org/repository)
Downloading: http://repo1.maven.org/maven2/com/jcraft/jsch/0.1.23/jsch-0.1.23.pom
485b downloaded
Downloading: http://cvs.apache.org/repository/org.apache.maven.reporting/poms/maven-reporting-api-2.0.pom
[WARNING] Unable to get resource from repository apache.snapshots (http://cvs.apache.org/repository)
Downloading: http://repo1.maven.org/maven2/org/apache/maven/reporting/maven-reporting-api/2.0/maven-reporting-api-2.0.pom
1K downloaded
Downloading: http://cvs.apache.org/repository/org.apache.maven.reporting/poms/maven-reporting-2.0.pom
[WARNING] Unable to get resource from repository apache.snapshots (http://cvs.apache.org/repository)
Downloading: http://repo1.maven.org/maven2/org/apache/maven/reporting/maven-reporting/2.0/maven-reporting-2.0.pom
504b downloaded
Downloading: http://cvs.apache.org/repository/doxia/poms/doxia-sink-api-1.0-alpha-4.pom
[WARNING] Unable to get resource from repository apache.snapshots (http://cvs.apache.org/repository)
Downloading: http://repo1.maven.org/maven2/doxia/doxia-sink-api/1.0-alpha-4/doxia-sink-api-1.0-alpha-4.pom
1K downloaded
Downloading: http://cvs.apache.org/repository/org.apache.maven/poms/maven-plugin-registry-2.0.pom
[WARNING] Unable to get resource from repository apache.snapshots (http://cvs.apache.org/repository)
Downloading: http://repo1.maven.org/maven2/org/apache/maven/maven-plugin-registry/2.0/maven-plugin-registry-2.0.pom
1K downloaded
[INFO] snapshot org.apache.geronimo.gbuild:gbuild-agent-web:1.0-SNAPSHOT: checking for updates
from apache.snapshots
[INFO] snapshot org.apache.geronimo.gbuild:gbuild-agent-web:1.0-SNAPSHOT: checking for updates
from snapshots
Downloading: http://cvs.apache.org/repository/org.apache.geronimo.gbuild/poms/gbuild-agent-web-1.0-SNAPSHOT.pom
[WARNING] Unable to get resource from repository apache.snapshots (http://cvs.apache.org/repository)
Downloading: http://snapshots.maven.codehaus.org/maven2/org/apache/geronimo/gbuild/gbuild-agent-web/1.0-SNAPSHOT/gbuild-agent-web-1.0-SNAPSHOT.pom
[WARNING] Unable to get resource from repository snapshots (http://snapshots.maven.codehaus.org/maven2)
[WARNING] 
  This artifact has been relocated to org.springframework:spring:1.2.2.


[WARNING] 
  This artifact has been relocated to xml-apis:xml-apis:1.0.b2.


[WARNING] 
  This artifact has been relocated to xml-apis:xml-apis:1.0.b2.


[WARNING] 
  This artifact has been relocated to xml-apis:xml-apis:1.0.b2.


[INFO] snapshot org.apache.geronimo.gbuild:gbuild-agent:1.0-SNAPSHOT: checking for updates
from apache.snapshots
[INFO] snapshot org.apache.geronimo.gbuild:gbuild-agent:1.0-SNAPSHOT: checking for updates
from snapshots
Downloading: http://cvs.apache.org/repository/org.apache.geronimo.gbuild/poms/gbuild-agent-1.0-SNAPSHOT.pom
[WARNING] Unable to get resource from repository apache.snapshots (http://cvs.apache.org/repository)
Downloading: http://snapshots.maven.codehaus.org/maven2/org/apache/geronimo/gbuild/gbuild-agent/1.0-SNAPSHOT/gbuild-agent-1.0-SNAPSHOT.pom
[WARNING] Unable to get resource from repository snapshots (http://snapshots.maven.codehaus.org/maven2)
Downloading: http://cvs.apache.org/repository/plexus/poms/plexus-container-artifact-1.0-alpha-3.pom
[WARNING] Unable to get resource from repository apache.snapshots (http://cvs.apache.org/repository)
Downloading: http://repo1.maven.org/maven2/plexus/plexus-container-artifact/1.0-alpha-3/plexus-container-artifact-1.0-alpha-3.pom
852b downloaded
Downloading: http://cvs.apache.org/repository/plexus/poms/plexus-containers-1.0-alpha-3.pom
[WARNING] Unable to get resource from repository apache.snapshots (http://cvs.apache.org/repository)
Downloading: http://repo1.maven.org/maven2/plexus/plexus-containers/1.0-alpha-3/plexus-containers-1.0-alpha-3.pom
475b downloaded
Downloading: http://cvs.apache.org/repository/org.apache.maven.wagon/poms/wagon-provider-api-1.0-alpha-3.pom
[WARNING] Unable to get resource from repository apache.snapshots (http://cvs.apache.org/repository)
Downloading: http://repo1.maven.org/maven2/org/apache/maven/wagon/wagon-provider-api/1.0-alpha-3/wagon-provider-api-1.0-alpha-3.pom
306b downloaded
Downloading: http://cvs.apache.org/repository/org.apache.maven.wagon/poms/wagon-1.0-alpha-3.pom
[WARNING] Unable to get resource from repository apache.snapshots (http://cvs.apache.org/repository)
Downloading: http://repo1.maven.org/maven2/org/apache/maven/wagon/wagon/1.0-alpha-3/wagon-1.0-alpha-3.pom
3K downloaded
Downloading: http://cvs.apache.org/repository/org.apache.maven/poms/maven-artifact-2.0-alpha-2.pom
[WARNING] Unable to get resource from repository apache.snapshots (http://cvs.apache.org/repository)
Downloading: http://repo1.maven.org/maven2/org/apache/maven/maven-artifact/2.0-alpha-2/maven-artifact-2.0-alpha-2.pom
848b downloaded
Downloading: http://cvs.apache.org/repository/org.apache.maven/poms/maven-2.0-alpha-2.pom
[WARNING] Unable to get resource from repository apache.snapshots (http://cvs.apache.org/repository)
Downloading: http://repo1.maven.org/maven2/org/apache/maven/maven/2.0-alpha-2/maven-2.0-alpha-2.pom
3K downloaded
Downloading: http://cvs.apache.org/repository/org.apache.maven/jars/maven-error-diagnostics-2.0.jar
[WARNING] Unable to get resource from repository apache.snapshots (http://cvs.apache.org/repository)
Downloading: http://repo1.maven.org/maven2/org/apache/maven/maven-error-diagnostics/2.0/maven-error-diagnostics-2.0.jar
10K downloaded
Downloading: http://cvs.apache.org/repository/org.apache.geronimo.gbuild/jars/gbuild-agent-web-1.0-SNAPSHOT.jar
[WARNING] Unable to get resource from repository apache.snapshots (http://cvs.apache.org/repository)
Downloading: http://snapshots.maven.codehaus.org/maven2/org/apache/geronimo/gbuild/gbuild-agent-web/1.0-SNAPSHOT/gbuild-agent-web-1.0-SNAPSHOT.jar
[WARNING] Unable to get resource from repository snapshots (http://snapshots.maven.codehaus.org/maven2)
[INFO] ----------------------------------------------------------------------------
[ERROR] BUILD ERROR
[INFO] ----------------------------------------------------------------------------
[INFO] Failed to resolve artifact.

GroupId: org.apache.geronimo.gbuild
ArtifactId: gbuild-agent-web
Version: 1.0-SNAPSHOT

Reason: Unable to download the artifact from any repository
  org.apache.geronimo.gbuild:gbuild-agent-web:1.0-SNAPSHOT:jar

from the specified remote repositories:
  central (http://repo1.maven.org/maven2),
  apache.snapshots (http://cvs.apache.org/repository),
  snapshots (http://snapshots.maven.codehaus.org/maven2)


[INFO] ----------------------------------------------------------------------------
[INFO] For more information, run Maven with the -e switch
[INFO] ----------------------------------------------------------------------------
[INFO] Total time: 1 minute 58 seconds
[INFO] Finished at: Thu Jan 12 21:26:43 PST 2006
[INFO] Final Memory: 7M/12M
[INFO] ----------------------------------------------------------------------------

****************************************************************************



Mime
View raw message