geronimo-scm mailing list archives

Site index · List index
Message view « Date » · « Thread »
Top « Date » · « Thread »
From continuum <contin...@stan.gbuild.org>
Subject [continuum] BUILD FAILURE: Geronimo
Date Sat, 07 Jan 2006 06:02:34 GMT
Online report : http://ci.gbuild.org/continuum/target/ProjectBuild.vm/view/ProjectBuild/id/1/buildId/693
Build statistics:
  State: Failed
  Previous State: Failed
  Started at: Fri, 6 Jan 2006 22:00:40 -0800
  Finished at: Fri, 6 Jan 2006 22:02:32 -0800
  Total time: 1m 52s
  Build Trigger: Schedule
  Exit code: 70
  Building machine hostname: stan.gbuild.org
  Operating system : Linux(unknown)
  Java version : 1.4.2_08(Sun Microsystems Inc.)

Changes
                            assemblies/j2ee-jetty-server/project.xml
            assemblies/j2ee-jetty-server/src/var/config/config.xml
            assemblies/j2ee-tomcat-server/project.xml
            assemblies/j2ee-tomcat-server/src/var/config/config.xml
            configs/welcome-tomcat/project.properties
            configs/console-tomcat/project.properties
            configs/j2ee-server/src/plan/plan.xml
            configs/jmxdebug-tomcat/project.properties
            configs/jsp-examples-tomcat/project.properties
            configs/console-jetty/project.properties
            configs/openejb-deployer/NOTICE.txt
            configs/openejb-deployer/LICENSE.txt
            configs/openejb-deployer/project.properties
            configs/openejb-deployer/maven.xml
            configs/openejb-deployer/project.xml
            configs/openejb-deployer/src/plan/plan.xml
            configs/daytrader-tomcat/project.properties
            configs/jsp-examples-jetty/project.properties
            configs/j2ee-deployer/src/plan/plan.xml
            configs/tomcat-deployer/src/plan/plan.xml
            configs/jetty-deployer/src/plan/plan.xml
            configs/servlets-examples-jetty/project.properties
            configs/openejb/NOTICE.txt
            configs/openejb/LICENSE.txt
            configs/openejb/project.properties
            configs/openejb/maven.xml
            configs/openejb/project.xml
            configs/openejb/src/plan/plan.xml
            configs/remote-deploy-jetty/project.properties
            configs/axis-deployer/NOTICE.txt
            configs/axis-deployer/LICENSE.txt
            configs/axis-deployer/project.properties
            configs/axis-deployer/maven.xml
            configs/axis-deployer/project.xml
            configs/axis-deployer/src/plan/plan.xml
            configs/system-database/project.properties
            configs/system-database/project.xml
            configs/ldap-demo-tomcat/project.properties
            configs/welcome-jetty/project.properties
            configs/ldap-demo-jetty/project.properties
            configs/jmxdebug-jetty/project.properties
            configs/axis/NOTICE.txt
            configs/axis/LICENSE.txt
            configs/axis/project.properties
            configs/axis/maven.xml
            configs/axis/project.xml
            configs/axis/src/plan/plan.xml
            configs/servlets-examples-tomcat/project.properties
            configs/remote-deploy-tomcat/project.properties
            configs/daytrader-jetty/project.properties
            modules/j2ee-builder/src/java/org/apache/geronimo/j2ee/deployment/UnavailableModuleBuilder.java
        
****************************************************************************
Output:
****************************************************************************
 __  __
|  \/  |__ _Apache__ ___
| |\/| / _` \ V / -_) ' \  ~ intelligent projects ~
|_|  |_\__,_|\_/\___|_||_|  v. 1.1-beta-2

DEPRECATED: the default goal should be specified in the <build> section of project.xml instead of maven.xml
DEPRECATED: the default goal should be specified in the <build> section of project.xml instead of maven.xml
Starting the reactor...
Our processing order:
Geronimo :: Activation
Geronimo :: Kernel
Geronimo :: Common
Geronimo :: Util
Geronimo :: System
Geronimo :: Deployment
Geronimo :: Core
Geronimo :: Management API
Geronimo :: J2EE
Geronimo :: J2EE Schema
Geronimo :: Service :: Builder
Geronimo :: Maven Dependency Plugin
Geronimo :: Security
Geronimo :: Web Services
Geronimo :: Axis
Geronimo :: Naming
Geronimo :: Deploy :: Common Config
Geronimo :: Test :: DDBeans
Geronimo :: Transaction
Geronimo :: Connector
Geronimo :: Security :: Builder
Geronimo :: J2EE
Geronimo :: Naming :: Builder
Geronimo :: Connector :: Builder
Geronimo :: Axis :: Builder
Geronimo :: Client
Geronimo :: Client Builder
Geronimo :: Console Web
Geronimo :: Configuration Converter
Geronimo :: Web :: Builder
Geronimo :: Deploy :: JSR-88
Geronimo :: Deploy :: CLI Tool
Geronimo :: Derby
Geronimo :: Directory
Geronimo :: Deploy :: Hot Deployer
Geronimo :: JavaMail Transport
Geronimo :: Jetty
Geronimo :: Jetty :: Builder
Geronimo :: JMX Remoting
Geronimo :: Mail
Geronimo :: Scripts
Geronimo :: Timer
Geronimo :: Tomcat
Geronimo :: Tomcat :: Builder
Geronimo :: Maven Assembly Plugin
Geronimo :: Maven Deployment Plugin
Geronimo :: IZPack Installer Build Plugin
Geronimo :: Maven Packaging Plugin
+----------------------------------------
| geronimo and geronimo-plugins Geronimo :: Activation
| Memory: 7M/9M
+----------------------------------------
DEPRECATED: the default goal should be specified in the <build> section of project.xml instead of maven.xml
build:start:

new1:
build:start:

multiproject:install-callback:
    [echo] Running jar:install for Geronimo :: Activation
java:prepare-filesystem:

java:compile:
<depend closure="false" srcdir="1.4" dump="false" destdir="/home/continuum/build/work/1/modules/activation/target/classes"></depend>    [echo] Compiling to /home/continuum/build/work/1/modules/activation/target/classes

java:jar-resources:

test:prepare-filesystem:

test:test-resources:

test:compile:

test:test:
    [echo] NOTICE: Skipping tests; they seem to have passed already
    [echo] No tests to run.
Running post goal: test:test

jar:jar:

jar:install:
    [echo] Installing...
Uploading to geronimo/jars/geronimo-activation-1.0-SNAPSHOT.jar: 
.................... (13K)
Uploading to geronimo/poms/geronimo-activation-1.0-SNAPSHOT.pom: 
.................... (10K)

+----------------------------------------
| geronimo and geronimo-plugins Geronimo :: Kernel
| Memory: 7M/11M
+----------------------------------------
DEPRECATED: the default goal should be specified in the <build> section of project.xml instead of maven.xml
DEPRECATED: the default goal should be specified in the <build> section of project.xml instead of maven.xml

build:end:

build:start:

multiproject:install-callback:
    [echo] Running jar:install for Geronimo :: Kernel
Tag library requested that is not present: 'xmlbeans2:maven' in plugin: 'null'
java:prepare-filesystem:

java:compile:
<depend closure="false" srcdir="1.4" dump="false" destdir="/home/continuum/build/work/1/modules/kernel/target/classes"></depend>    [echo] Compiling to /home/continuum/build/work/1/modules/kernel/target/classes

java:jar-resources:

test:prepare-filesystem:

test:test-resources:

test:compile:

test:test:
    [echo] NOTICE: Skipping tests; they seem to have passed already
    [echo] No tests to run.
Running post goal: test:test

jar:jar:

jar:install:
    [echo] Installing...
Uploading to geronimo/jars/geronimo-kernel-1.0-SNAPSHOT.jar: 
.................... (223K)
Uploading to geronimo/poms/geronimo-kernel-1.0-SNAPSHOT.pom: 
.................... (10K)

+----------------------------------------
| geronimo and geronimo-plugins Geronimo :: Common
| Memory: 9M/11M
+----------------------------------------
DEPRECATED: the default goal should be specified in the <build> section of project.xml instead of maven.xml

build:end:

Attempting to download geronimo-kernel-1.0-SNAPSHOT.jar.
Error getting URI host
org.apache.commons.httpclient.HttpException: Redirect from host codehaus.org to www.codehaus.org is not supported
	at org.apache.commons.httpclient.HttpMethodBase.checkValidRedirect(HttpMethodBase.java:1237)
	at org.apache.commons.httpclient.HttpMethodBase.processRedirectResponse(HttpMethodBase.java:1185)
	at org.apache.commons.httpclient.HttpMethodBase.isRetryNeeded(HttpMethodBase.java:967)
	at org.apache.commons.httpclient.HttpMethodBase.execute(HttpMethodBase.java:1089)
	at org.apache.commons.httpclient.HttpClient.executeMethod(HttpClient.java:643)
	at org.apache.commons.httpclient.HttpClient.executeMethod(HttpClient.java:497)
	at org.apache.maven.wagon.providers.http.HttpWagon.get(HttpWagon.java:287)
	at org.apache.maven.wagon.providers.http.HttpWagon.getIfNewer(HttpWagon.java:234)
	at org.apache.maven.verifier.DependencyVerifier.getRemoteArtifact(DependencyVerifier.java:391)
	at org.apache.maven.verifier.DependencyVerifier.getDependencies(DependencyVerifier.java:291)
	at org.apache.maven.verifier.DependencyVerifier.satisfyDependencies(DependencyVerifier.java:182)
	at org.apache.maven.verifier.DependencyVerifier.verify(DependencyVerifier.java:99)
	at org.apache.maven.project.Project.verifyDependencies(Project.java:569)
	at org.apache.maven.plugin.PluginManager.attainGoals(PluginManager.java:663)
	at org.apache.maven.MavenSession.attainGoals(MavenSession.java:263)
	at org.apache.maven.jelly.tags.maven.ReactorTag.doTag(ReactorTag.java:368)
	at org.apache.commons.jelly.impl.TagScript.run(TagScript.java:247)
	at org.apache.commons.jelly.impl.ScriptBlock.run(ScriptBlock.java:95)
	at org.apache.maven.jelly.tags.werkz.MavenGoalTag.runBodyTag(MavenGoalTag.java:78)
	at org.apache.maven.jelly.tags.werkz.MavenGoalTag$MavenGoalAction.performAction(MavenGoalTag.java:109)
	at org.apache.maven.werkz.Goal.fire(Goal.java:656)
	at org.apache.maven.werkz.Goal.attain(Goal.java:592)
	at org.apache.maven.plugin.PluginManager.attainGoals(PluginManager.java:693)
	at org.apache.maven.MavenSession.attainGoals(MavenSession.java:263)
	at org.apache.maven.cli.App.doMain(App.java:511)
	at org.apache.maven.cli.App.main(App.java:1258)
	at sun.reflect.NativeMethodAccessorImpl.invoke0(Native Method)
	at sun.reflect.NativeMethodAccessorImpl.invoke(NativeMethodAccessorImpl.java:39)
	at sun.reflect.DelegatingMethodAccessorImpl.invoke(DelegatingMethodAccessorImpl.java:25)
	at java.lang.reflect.Method.invoke(Method.java:324)
	at com.werken.forehead.Forehead.run(Forehead.java:551)
	at com.werken.forehead.Forehead.main(Forehead.java:581)
Invalid Redirect URI from: http://codehaus.org:80/~jgenender/maven2//geronimo/jars/geronimo-kernel-1.0-SNAPSHOT.jar to: http://www.codehaus.org/~jgenender/maven2//geronimo/jars/geronimo-kernel-1.0-SNAPSHOT.jar
Error retrieving artifact from [http://codehaus.org/~jgenender/maven2]: org.apache.maven.wagon.TransferFailedException: Failed to trasfer file: http://codehaus.org/~jgenender/maven2//geronimo/jars/geronimo-kernel-1.0-SNAPSHOT.jar. Return code is: 302
build:start:

multiproject:install-callback:
    [echo] Running jar:install for Geronimo :: Common
java:prepare-filesystem:

java:compile:
<depend closure="false" srcdir="1.4" dump="false" destdir="/home/continuum/build/work/1/modules/common/target/classes"></depend>    [echo] Compiling to /home/continuum/build/work/1/modules/common/target/classes

java:jar-resources:

test:prepare-filesystem:

test:test-resources:

test:compile:

test:test:
    [echo] NOTICE: Skipping tests; they seem to have passed already
    [echo] No tests to run.
Running post goal: test:test

jar:jar:

jar:install:
    [echo] Installing...
Uploading to geronimo/jars/geronimo-common-1.0-SNAPSHOT.jar: 
.................... (35K)
Uploading to geronimo/poms/geronimo-common-1.0-SNAPSHOT.pom: 
.................... (9K)

+----------------------------------------
| geronimo and geronimo-plugins Geronimo :: Util
| Memory: 9M/11M
+----------------------------------------
DEPRECATED: the default goal should be specified in the <build> section of project.xml instead of maven.xml

build:end:

build:start:

multiproject:install-callback:
    [echo] Running jar:install for Geronimo :: Util
java:prepare-filesystem:

java:compile:
<depend closure="false" srcdir="1.4" dump="false" destdir="/home/continuum/build/work/1/modules/util/target/classes"></depend>    [echo] Compiling to /home/continuum/build/work/1/modules/util/target/classes

java:jar-resources:

test:prepare-filesystem:

test:test-resources:

test:compile:

test:test:
    [echo] NOTICE: Skipping tests; they seem to have passed already
    [echo] No tests to run.
Running post goal: test:test

jar:jar:

jar:install:
    [echo] Installing...
Uploading to geronimo/jars/geronimo-util-1.0-SNAPSHOT.jar: 
.................... (242K)
Uploading to geronimo/poms/geronimo-util-1.0-SNAPSHOT.pom: 
.................... (9K)

+----------------------------------------
| geronimo and geronimo-plugins Geronimo :: System
| Memory: 7M/13M
+----------------------------------------
DEPRECATED: the default goal should be specified in the <build> section of project.xml instead of maven.xml
DEPRECATED: the default goal should be specified in the <build> section of project.xml instead of maven.xml

build:end:

Attempting to download geronimo-common-1.0-SNAPSHOT.jar.
Error getting URI host
org.apache.commons.httpclient.HttpException: Redirect from host codehaus.org to www.codehaus.org is not supported
	at org.apache.commons.httpclient.HttpMethodBase.checkValidRedirect(HttpMethodBase.java:1237)
	at org.apache.commons.httpclient.HttpMethodBase.processRedirectResponse(HttpMethodBase.java:1185)
	at org.apache.commons.httpclient.HttpMethodBase.isRetryNeeded(HttpMethodBase.java:967)
	at org.apache.commons.httpclient.HttpMethodBase.execute(HttpMethodBase.java:1089)
	at org.apache.commons.httpclient.HttpClient.executeMethod(HttpClient.java:643)
	at org.apache.commons.httpclient.HttpClient.executeMethod(HttpClient.java:497)
	at org.apache.maven.wagon.providers.http.HttpWagon.get(HttpWagon.java:287)
	at org.apache.maven.wagon.providers.http.HttpWagon.getIfNewer(HttpWagon.java:234)
	at org.apache.maven.verifier.DependencyVerifier.getRemoteArtifact(DependencyVerifier.java:391)
	at org.apache.maven.verifier.DependencyVerifier.getDependencies(DependencyVerifier.java:291)
	at org.apache.maven.verifier.DependencyVerifier.satisfyDependencies(DependencyVerifier.java:182)
	at org.apache.maven.verifier.DependencyVerifier.verify(DependencyVerifier.java:99)
	at org.apache.maven.project.Project.verifyDependencies(Project.java:569)
	at org.apache.maven.plugin.PluginManager.attainGoals(PluginManager.java:663)
	at org.apache.maven.MavenSession.attainGoals(MavenSession.java:263)
	at org.apache.maven.jelly.tags.maven.ReactorTag.doTag(ReactorTag.java:368)
	at org.apache.commons.jelly.impl.TagScript.run(TagScript.java:247)
	at org.apache.commons.jelly.impl.ScriptBlock.run(ScriptBlock.java:95)
	at org.apache.maven.jelly.tags.werkz.MavenGoalTag.runBodyTag(MavenGoalTag.java:78)
	at org.apache.maven.jelly.tags.werkz.MavenGoalTag$MavenGoalAction.performAction(MavenGoalTag.java:109)
	at org.apache.maven.werkz.Goal.fire(Goal.java:656)
	at org.apache.maven.werkz.Goal.attain(Goal.java:592)
	at org.apache.maven.plugin.PluginManager.attainGoals(PluginManager.java:693)
	at org.apache.maven.MavenSession.attainGoals(MavenSession.java:263)
	at org.apache.maven.cli.App.doMain(App.java:511)
	at org.apache.maven.cli.App.main(App.java:1258)
	at sun.reflect.NativeMethodAccessorImpl.invoke0(Native Method)
	at sun.reflect.NativeMethodAccessorImpl.invoke(NativeMethodAccessorImpl.java:39)
	at sun.reflect.DelegatingMethodAccessorImpl.invoke(DelegatingMethodAccessorImpl.java:25)
	at java.lang.reflect.Method.invoke(Method.java:324)
	at com.werken.forehead.Forehead.run(Forehead.java:551)
	at com.werken.forehead.Forehead.main(Forehead.java:581)
Invalid Redirect URI from: http://codehaus.org:80/~jgenender/maven2//geronimo/jars/geronimo-common-1.0-SNAPSHOT.jar to: http://www.codehaus.org/~jgenender/maven2//geronimo/jars/geronimo-common-1.0-SNAPSHOT.jar
Error retrieving artifact from [http://codehaus.org/~jgenender/maven2]: org.apache.maven.wagon.TransferFailedException: Failed to trasfer file: http://codehaus.org/~jgenender/maven2//geronimo/jars/geronimo-common-1.0-SNAPSHOT.jar. Return code is: 302
Attempting to download geronimo-util-1.0-SNAPSHOT.jar.
Error getting URI host
org.apache.commons.httpclient.HttpException: Redirect from host codehaus.org to www.codehaus.org is not supported
	at org.apache.commons.httpclient.HttpMethodBase.checkValidRedirect(HttpMethodBase.java:1237)
	at org.apache.commons.httpclient.HttpMethodBase.processRedirectResponse(HttpMethodBase.java:1185)
	at org.apache.commons.httpclient.HttpMethodBase.isRetryNeeded(HttpMethodBase.java:967)
	at org.apache.commons.httpclient.HttpMethodBase.execute(HttpMethodBase.java:1089)
	at org.apache.commons.httpclient.HttpClient.executeMethod(HttpClient.java:643)
	at org.apache.commons.httpclient.HttpClient.executeMethod(HttpClient.java:497)
	at org.apache.maven.wagon.providers.http.HttpWagon.get(HttpWagon.java:287)
	at org.apache.maven.wagon.providers.http.HttpWagon.getIfNewer(HttpWagon.java:234)
	at org.apache.maven.verifier.DependencyVerifier.getRemoteArtifact(DependencyVerifier.java:391)
	at org.apache.maven.verifier.DependencyVerifier.getDependencies(DependencyVerifier.java:291)
	at org.apache.maven.verifier.DependencyVerifier.satisfyDependencies(DependencyVerifier.java:182)
	at org.apache.maven.verifier.DependencyVerifier.verify(DependencyVerifier.java:99)
	at org.apache.maven.project.Project.verifyDependencies(Project.java:569)
	at org.apache.maven.plugin.PluginManager.attainGoals(PluginManager.java:663)
	at org.apache.maven.MavenSession.attainGoals(MavenSession.java:263)
	at org.apache.maven.jelly.tags.maven.ReactorTag.doTag(ReactorTag.java:368)
	at org.apache.commons.jelly.impl.TagScript.run(TagScript.java:247)
	at org.apache.commons.jelly.impl.ScriptBlock.run(ScriptBlock.java:95)
	at org.apache.maven.jelly.tags.werkz.MavenGoalTag.runBodyTag(MavenGoalTag.java:78)
	at org.apache.maven.jelly.tags.werkz.MavenGoalTag$MavenGoalAction.performAction(MavenGoalTag.java:109)
	at org.apache.maven.werkz.Goal.fire(Goal.java:656)
	at org.apache.maven.werkz.Goal.attain(Goal.java:592)
	at org.apache.maven.plugin.PluginManager.attainGoals(PluginManager.java:693)
	at org.apache.maven.MavenSession.attainGoals(MavenSession.java:263)
	at org.apache.maven.cli.App.doMain(App.java:511)
	at org.apache.maven.cli.App.main(App.java:1258)
	at sun.reflect.NativeMethodAccessorImpl.invoke0(Native Method)
	at sun.reflect.NativeMethodAccessorImpl.invoke(NativeMethodAccessorImpl.java:39)
	at sun.reflect.DelegatingMethodAccessorImpl.invoke(DelegatingMethodAccessorImpl.java:25)
	at java.lang.reflect.Method.invoke(Method.java:324)
	at com.werken.forehead.Forehead.run(Forehead.java:551)
	at com.werken.forehead.Forehead.main(Forehead.java:581)
Invalid Redirect URI from: http://codehaus.org:80/~jgenender/maven2//geronimo/jars/geronimo-util-1.0-SNAPSHOT.jar to: http://www.codehaus.org/~jgenender/maven2//geronimo/jars/geronimo-util-1.0-SNAPSHOT.jar
Error retrieving artifact from [http://codehaus.org/~jgenender/maven2]: org.apache.maven.wagon.TransferFailedException: Failed to trasfer file: http://codehaus.org/~jgenender/maven2//geronimo/jars/geronimo-util-1.0-SNAPSHOT.jar. Return code is: 302
build:start:

multiproject:install-callback:
    [echo] Running jar:install for Geronimo :: System
java:prepare-filesystem:

java:compile:
<depend closure="false" srcdir="1.4" dump="false" destdir="/home/continuum/build/work/1/modules/system/target/classes"></depend>    [echo] Compiling to /home/continuum/build/work/1/modules/system/target/classes
Running post goal: java:compile

java:jar-resources:

test:prepare-filesystem:

test:test-resources:
Running post goal: test:test-resources
    [delete] Deleting directory /home/continuum/build/work/1/modules/system/target/tmp
    [mkdir] Created dir: /home/continuum/build/work/1/modules/system/target/tmp

test:compile:

test:test:
    [echo] NOTICE: Skipping tests; they seem to have passed already
    [echo] No tests to run.
Running post goal: test:test

jar:jar:
    [jar] Building jar: /home/continuum/build/work/1/modules/system/target/geronimo-system-1.0-SNAPSHOT.jar

jar:install:
    [echo] Installing...
Uploading to geronimo/jars/geronimo-system-1.0-SNAPSHOT.jar: 
.................... (142K)
Uploading to geronimo/poms/geronimo-system-1.0-SNAPSHOT.pom: 
.................... (10K)

+----------------------------------------
| geronimo and geronimo-plugins Geronimo :: Deployment
| Memory: 9M/13M
+----------------------------------------
DEPRECATED: the default goal should be specified in the <build> section of project.xml instead of maven.xml
DEPRECATED: the default goal should be specified in the <build> section of project.xml instead of maven.xml

build:end:

Attempting to download geronimo-system-1.0-SNAPSHOT.jar.
Error getting URI host
org.apache.commons.httpclient.HttpException: Redirect from host codehaus.org to www.codehaus.org is not supported
	at org.apache.commons.httpclient.HttpMethodBase.checkValidRedirect(HttpMethodBase.java:1237)
	at org.apache.commons.httpclient.HttpMethodBase.processRedirectResponse(HttpMethodBase.java:1185)
	at org.apache.commons.httpclient.HttpMethodBase.isRetryNeeded(HttpMethodBase.java:967)
	at org.apache.commons.httpclient.HttpMethodBase.execute(HttpMethodBase.java:1089)
	at org.apache.commons.httpclient.HttpClient.executeMethod(HttpClient.java:643)
	at org.apache.commons.httpclient.HttpClient.executeMethod(HttpClient.java:497)
	at org.apache.maven.wagon.providers.http.HttpWagon.get(HttpWagon.java:287)
	at org.apache.maven.wagon.providers.http.HttpWagon.getIfNewer(HttpWagon.java:234)
	at org.apache.maven.verifier.DependencyVerifier.getRemoteArtifact(DependencyVerifier.java:391)
	at org.apache.maven.verifier.DependencyVerifier.getDependencies(DependencyVerifier.java:291)
	at org.apache.maven.verifier.DependencyVerifier.satisfyDependencies(DependencyVerifier.java:182)
	at org.apache.maven.verifier.DependencyVerifier.verify(DependencyVerifier.java:99)
	at org.apache.maven.project.Project.verifyDependencies(Project.java:569)
	at org.apache.maven.plugin.PluginManager.attainGoals(PluginManager.java:663)
	at org.apache.maven.MavenSession.attainGoals(MavenSession.java:263)
	at org.apache.maven.jelly.tags.maven.ReactorTag.doTag(ReactorTag.java:368)
	at org.apache.commons.jelly.impl.TagScript.run(TagScript.java:247)
	at org.apache.commons.jelly.impl.ScriptBlock.run(ScriptBlock.java:95)
	at org.apache.maven.jelly.tags.werkz.MavenGoalTag.runBodyTag(MavenGoalTag.java:78)
	at org.apache.maven.jelly.tags.werkz.MavenGoalTag$MavenGoalAction.performAction(MavenGoalTag.java:109)
	at org.apache.maven.werkz.Goal.fire(Goal.java:656)
	at org.apache.maven.werkz.Goal.attain(Goal.java:592)
	at org.apache.maven.plugin.PluginManager.attainGoals(PluginManager.java:693)
	at org.apache.maven.MavenSession.attainGoals(MavenSession.java:263)
	at org.apache.maven.cli.App.doMain(App.java:511)
	at org.apache.maven.cli.App.main(App.java:1258)
	at sun.reflect.NativeMethodAccessorImpl.invoke0(Native Method)
	at sun.reflect.NativeMethodAccessorImpl.invoke(NativeMethodAccessorImpl.java:39)
	at sun.reflect.DelegatingMethodAccessorImpl.invoke(DelegatingMethodAccessorImpl.java:25)
	at java.lang.reflect.Method.invoke(Method.java:324)
	at com.werken.forehead.Forehead.run(Forehead.java:551)
	at com.werken.forehead.Forehead.main(Forehead.java:581)
Invalid Redirect URI from: http://codehaus.org:80/~jgenender/maven2//geronimo/jars/geronimo-system-1.0-SNAPSHOT.jar to: http://www.codehaus.org/~jgenender/maven2//geronimo/jars/geronimo-system-1.0-SNAPSHOT.jar
Error retrieving artifact from [http://codehaus.org/~jgenender/maven2]: org.apache.maven.wagon.TransferFailedException: Failed to trasfer file: http://codehaus.org/~jgenender/maven2//geronimo/jars/geronimo-system-1.0-SNAPSHOT.jar. Return code is: 302
build:start:

multiproject:install-callback:
    [echo] Running jar:install for Geronimo :: Deployment
java:prepare-filesystem:

java:compile:
<depend closure="false" srcdir="1.4" dump="false" destdir="/home/continuum/build/work/1/modules/deployment/target/classes"></depend>    [echo] Compiling to /home/continuum/build/work/1/modules/deployment/target/classes

java:jar-resources:

test:prepare-filesystem:

test:test-resources:

test:compile:

test:test:
    [echo] NOTICE: Skipping tests; they seem to have passed already
    [echo] No tests to run.
Running post goal: test:test

jar:jar:

jar:install:
    [echo] Installing...
Uploading to geronimo/jars/geronimo-deployment-1.0-SNAPSHOT.jar: 
.................... (51K)
Uploading to geronimo/poms/geronimo-deployment-1.0-SNAPSHOT.pom: 
.................... (10K)

+----------------------------------------
| geronimo and geronimo-plugins Geronimo :: Core
| Memory: 9M/13M
+----------------------------------------
DEPRECATED: the default goal should be specified in the <build> section of project.xml instead of maven.xml
DEPRECATED: the default goal should be specified in the <build> section of project.xml instead of maven.xml

build:end:

build:start:

multiproject:install-callback:
    [echo] Running jar:install for Geronimo :: Core
java:prepare-filesystem:

java:compile:
<depend closure="false" srcdir="1.4" dump="false" destdir="/home/continuum/build/work/1/modules/core/target/classes"></depend>    [echo] Compiling to /home/continuum/build/work/1/modules/core/target/classes

java:jar-resources:

test:prepare-filesystem:

test:test-resources:

test:compile:

test:test:
    [echo] NOTICE: Skipping tests; they seem to have passed already
    [echo] No tests to run.
Running post goal: test:test

jar:jar:

jar:install:
    [echo] Installing...
Uploading to geronimo/jars/geronimo-core-1.0-SNAPSHOT.jar: 
.................... (35K)
Uploading to geronimo/poms/geronimo-core-1.0-SNAPSHOT.pom: 
.................... (10K)

+----------------------------------------
| geronimo and geronimo-plugins Geronimo :: Management API
| Memory: 10M/13M
+----------------------------------------
DEPRECATED: the default goal should be specified in the <build> section of project.xml instead of maven.xml
DEPRECATED: the default goal should be specified in the <build> section of project.xml instead of maven.xml

build:end:

build:start:

multiproject:install-callback:
    [echo] Running jar:install for Geronimo :: Management API
java:prepare-filesystem:

java:compile:
<depend closure="false" srcdir="1.4" dump="false" destdir="/home/continuum/build/work/1/modules/management/target/classes"></depend>    [echo] Compiling to /home/continuum/build/work/1/modules/management/target/classes

java:jar-resources:

test:prepare-filesystem:

test:test-resources:

test:compile:
    [echo] No test source files to compile.

test:test:
    [echo] NOTICE: Skipping tests; they seem to have passed already
    [echo] No tests to run.
Running post goal: test:test

jar:jar:

jar:install:
    [echo] Installing...
Uploading to geronimo/jars/geronimo-management-1.0-SNAPSHOT.jar: 
.................... (34K)
Uploading to geronimo/poms/geronimo-management-1.0-SNAPSHOT.pom: 
.................... (9K)

+----------------------------------------
| geronimo and geronimo-plugins Geronimo :: J2EE
| Memory: 11M/13M
+----------------------------------------
DEPRECATED: the default goal should be specified in the <build> section of project.xml instead of maven.xml
DEPRECATED: the default goal should be specified in the <build> section of project.xml instead of maven.xml

build:end:

Attempting to download geronimo-core-1.0-SNAPSHOT.jar.
Error getting URI host
org.apache.commons.httpclient.HttpException: Redirect from host codehaus.org to www.codehaus.org is not supported
	at org.apache.commons.httpclient.HttpMethodBase.checkValidRedirect(HttpMethodBase.java:1237)
	at org.apache.commons.httpclient.HttpMethodBase.processRedirectResponse(HttpMethodBase.java:1185)
	at org.apache.commons.httpclient.HttpMethodBase.isRetryNeeded(HttpMethodBase.java:967)
	at org.apache.commons.httpclient.HttpMethodBase.execute(HttpMethodBase.java:1089)
	at org.apache.commons.httpclient.HttpClient.executeMethod(HttpClient.java:643)
	at org.apache.commons.httpclient.HttpClient.executeMethod(HttpClient.java:497)
	at org.apache.maven.wagon.providers.http.HttpWagon.get(HttpWagon.java:287)
	at org.apache.maven.wagon.providers.http.HttpWagon.getIfNewer(HttpWagon.java:234)
	at org.apache.maven.verifier.DependencyVerifier.getRemoteArtifact(DependencyVerifier.java:391)
	at org.apache.maven.verifier.DependencyVerifier.getDependencies(DependencyVerifier.java:291)
	at org.apache.maven.verifier.DependencyVerifier.satisfyDependencies(DependencyVerifier.java:182)
	at org.apache.maven.verifier.DependencyVerifier.verify(DependencyVerifier.java:99)
	at org.apache.maven.project.Project.verifyDependencies(Project.java:569)
	at org.apache.maven.plugin.PluginManager.attainGoals(PluginManager.java:663)
	at org.apache.maven.MavenSession.attainGoals(MavenSession.java:263)
	at org.apache.maven.jelly.tags.maven.ReactorTag.doTag(ReactorTag.java:368)
	at org.apache.commons.jelly.impl.TagScript.run(TagScript.java:247)
	at org.apache.commons.jelly.impl.ScriptBlock.run(ScriptBlock.java:95)
	at org.apache.maven.jelly.tags.werkz.MavenGoalTag.runBodyTag(MavenGoalTag.java:78)
	at org.apache.maven.jelly.tags.werkz.MavenGoalTag$MavenGoalAction.performAction(MavenGoalTag.java:109)
	at org.apache.maven.werkz.Goal.fire(Goal.java:656)
	at org.apache.maven.werkz.Goal.attain(Goal.java:592)
	at org.apache.maven.plugin.PluginManager.attainGoals(PluginManager.java:693)
	at org.apache.maven.MavenSession.attainGoals(MavenSession.java:263)
	at org.apache.maven.cli.App.doMain(App.java:511)
	at org.apache.maven.cli.App.main(App.java:1258)
	at sun.reflect.NativeMethodAccessorImpl.invoke0(Native Method)
	at sun.reflect.NativeMethodAccessorImpl.invoke(NativeMethodAccessorImpl.java:39)
	at sun.reflect.DelegatingMethodAccessorImpl.invoke(DelegatingMethodAccessorImpl.java:25)
	at java.lang.reflect.Method.invoke(Method.java:324)
	at com.werken.forehead.Forehead.run(Forehead.java:551)
	at com.werken.forehead.Forehead.main(Forehead.java:581)
Invalid Redirect URI from: http://codehaus.org:80/~jgenender/maven2//geronimo/jars/geronimo-core-1.0-SNAPSHOT.jar to: http://www.codehaus.org/~jgenender/maven2//geronimo/jars/geronimo-core-1.0-SNAPSHOT.jar
Error retrieving artifact from [http://codehaus.org/~jgenender/maven2]: org.apache.maven.wagon.TransferFailedException: Failed to trasfer file: http://codehaus.org/~jgenender/maven2//geronimo/jars/geronimo-core-1.0-SNAPSHOT.jar. Return code is: 302
Attempting to download geronimo-management-1.0-SNAPSHOT.jar.
Error getting URI host
org.apache.commons.httpclient.HttpException: Redirect from host codehaus.org to www.codehaus.org is not supported
	at org.apache.commons.httpclient.HttpMethodBase.checkValidRedirect(HttpMethodBase.java:1237)
	at org.apache.commons.httpclient.HttpMethodBase.processRedirectResponse(HttpMethodBase.java:1185)
	at org.apache.commons.httpclient.HttpMethodBase.isRetryNeeded(HttpMethodBase.java:967)
	at org.apache.commons.httpclient.HttpMethodBase.execute(HttpMethodBase.java:1089)
	at org.apache.commons.httpclient.HttpClient.executeMethod(HttpClient.java:643)
	at org.apache.commons.httpclient.HttpClient.executeMethod(HttpClient.java:497)
	at org.apache.maven.wagon.providers.http.HttpWagon.get(HttpWagon.java:287)
	at org.apache.maven.wagon.providers.http.HttpWagon.getIfNewer(HttpWagon.java:234)
	at org.apache.maven.verifier.DependencyVerifier.getRemoteArtifact(DependencyVerifier.java:391)
	at org.apache.maven.verifier.DependencyVerifier.getDependencies(DependencyVerifier.java:291)
	at org.apache.maven.verifier.DependencyVerifier.satisfyDependencies(DependencyVerifier.java:182)
	at org.apache.maven.verifier.DependencyVerifier.verify(DependencyVerifier.java:99)
	at org.apache.maven.project.Project.verifyDependencies(Project.java:569)
	at org.apache.maven.plugin.PluginManager.attainGoals(PluginManager.java:663)
	at org.apache.maven.MavenSession.attainGoals(MavenSession.java:263)
	at org.apache.maven.jelly.tags.maven.ReactorTag.doTag(ReactorTag.java:368)
	at org.apache.commons.jelly.impl.TagScript.run(TagScript.java:247)
	at org.apache.commons.jelly.impl.ScriptBlock.run(ScriptBlock.java:95)
	at org.apache.maven.jelly.tags.werkz.MavenGoalTag.runBodyTag(MavenGoalTag.java:78)
	at org.apache.maven.jelly.tags.werkz.MavenGoalTag$MavenGoalAction.performAction(MavenGoalTag.java:109)
	at org.apache.maven.werkz.Goal.fire(Goal.java:656)
	at org.apache.maven.werkz.Goal.attain(Goal.java:592)
	at org.apache.maven.plugin.PluginManager.attainGoals(PluginManager.java:693)
	at org.apache.maven.MavenSession.attainGoals(MavenSession.java:263)
	at org.apache.maven.cli.App.doMain(App.java:511)
	at org.apache.maven.cli.App.main(App.java:1258)
	at sun.reflect.NativeMethodAccessorImpl.invoke0(Native Method)
	at sun.reflect.NativeMethodAccessorImpl.invoke(NativeMethodAccessorImpl.java:39)
	at sun.reflect.DelegatingMethodAccessorImpl.invoke(DelegatingMethodAccessorImpl.java:25)
	at java.lang.reflect.Method.invoke(Method.java:324)
	at com.werken.forehead.Forehead.run(Forehead.java:551)
	at com.werken.forehead.Forehead.main(Forehead.java:581)
Invalid Redirect URI from: http://codehaus.org:80/~jgenender/maven2//geronimo/jars/geronimo-management-1.0-SNAPSHOT.jar to: http://www.codehaus.org/~jgenender/maven2//geronimo/jars/geronimo-management-1.0-SNAPSHOT.jar
Error retrieving artifact from [http://codehaus.org/~jgenender/maven2]: org.apache.maven.wagon.TransferFailedException: Failed to trasfer file: http://codehaus.org/~jgenender/maven2//geronimo/jars/geronimo-management-1.0-SNAPSHOT.jar. Return code is: 302
build:start:

multiproject:install-callback:
    [echo] Running jar:install for Geronimo :: J2EE
java:prepare-filesystem:

java:compile:
<depend closure="false" srcdir="1.4" dump="false" destdir="/home/continuum/build/work/1/modules/j2ee/target/classes"></depend>    [echo] Compiling to /home/continuum/build/work/1/modules/j2ee/target/classes

java:jar-resources:

test:prepare-filesystem:

test:test-resources:

test:compile:

test:test:
    [echo] NOTICE: Skipping tests; they seem to have passed already
    [echo] No tests to run.
Running post goal: test:test

jar:jar:

jar:install:
    [echo] Installing...
Uploading to geronimo/jars/geronimo-j2ee-1.0-SNAPSHOT.jar: 
.................... (30K)
Uploading to geronimo/poms/geronimo-j2ee-1.0-SNAPSHOT.pom: 
.................... (11K)

+----------------------------------------
| geronimo and geronimo-plugins Geronimo :: J2EE Schema
| Memory: 12M/13M
+----------------------------------------
DEPRECATED: the default goal should be specified in the <build> section of project.xml instead of maven.xml
DEPRECATED: the default goal should be specified in the <build> section of project.xml instead of maven.xml

build:end:

build:start:

multiproject:install-callback:
    [echo] Running jar:install for Geronimo :: J2EE Schema
java:prepare-filesystem:

java:compile:
<depend closure="false" srcdir="1.4" dump="false" destdir="/home/continuum/build/work/1/modules/j2ee-schema/target/classes"></depend>    [echo] Compiling to /home/continuum/build/work/1/modules/j2ee-schema/target/classes

java:jar-resources:

test:prepare-filesystem:

test:test-resources:

test:compile:

test:test:
    [echo] NOTICE: Skipping tests; they seem to have passed already
    [echo] No tests to run.
Running post goal: test:test

jar:jar:

jar:install:
    [echo] Installing...
Uploading to geronimo/jars/geronimo-j2ee-schema-1.0-SNAPSHOT.jar: 
.................... (1501K)
Uploading to geronimo/poms/geronimo-j2ee-schema-1.0-SNAPSHOT.pom: 
.................... (10K)

+----------------------------------------
| geronimo and geronimo-plugins Geronimo :: Service :: Builder
| Memory: 11M/15M
+----------------------------------------
DEPRECATED: the default goal should be specified in the <build> section of project.xml instead of maven.xml
DEPRECATED: the default goal should be specified in the <build> section of project.xml instead of maven.xml

build:end:

Attempting to download geronimo-deployment-1.0-SNAPSHOT.jar.
Error getting URI host
org.apache.commons.httpclient.HttpException: Redirect from host codehaus.org to www.codehaus.org is not supported
	at org.apache.commons.httpclient.HttpMethodBase.checkValidRedirect(HttpMethodBase.java:1237)
	at org.apache.commons.httpclient.HttpMethodBase.processRedirectResponse(HttpMethodBase.java:1185)
	at org.apache.commons.httpclient.HttpMethodBase.isRetryNeeded(HttpMethodBase.java:967)
	at org.apache.commons.httpclient.HttpMethodBase.execute(HttpMethodBase.java:1089)
	at org.apache.commons.httpclient.HttpClient.executeMethod(HttpClient.java:643)
	at org.apache.commons.httpclient.HttpClient.executeMethod(HttpClient.java:497)
	at org.apache.maven.wagon.providers.http.HttpWagon.get(HttpWagon.java:287)
	at org.apache.maven.wagon.providers.http.HttpWagon.getIfNewer(HttpWagon.java:234)
	at org.apache.maven.verifier.DependencyVerifier.getRemoteArtifact(DependencyVerifier.java:391)
	at org.apache.maven.verifier.DependencyVerifier.getDependencies(DependencyVerifier.java:291)
	at org.apache.maven.verifier.DependencyVerifier.satisfyDependencies(DependencyVerifier.java:182)
	at org.apache.maven.verifier.DependencyVerifier.verify(DependencyVerifier.java:99)
	at org.apache.maven.project.Project.verifyDependencies(Project.java:569)
	at org.apache.maven.plugin.PluginManager.attainGoals(PluginManager.java:663)
	at org.apache.maven.MavenSession.attainGoals(MavenSession.java:263)
	at org.apache.maven.jelly.tags.maven.ReactorTag.doTag(ReactorTag.java:368)
	at org.apache.commons.jelly.impl.TagScript.run(TagScript.java:247)
	at org.apache.commons.jelly.impl.ScriptBlock.run(ScriptBlock.java:95)
	at org.apache.maven.jelly.tags.werkz.MavenGoalTag.runBodyTag(MavenGoalTag.java:78)
	at org.apache.maven.jelly.tags.werkz.MavenGoalTag$MavenGoalAction.performAction(MavenGoalTag.java:109)
	at org.apache.maven.werkz.Goal.fire(Goal.java:656)
	at org.apache.maven.werkz.Goal.attain(Goal.java:592)
	at org.apache.maven.plugin.PluginManager.attainGoals(PluginManager.java:693)
	at org.apache.maven.MavenSession.attainGoals(MavenSession.java:263)
	at org.apache.maven.cli.App.doMain(App.java:511)
	at org.apache.maven.cli.App.main(App.java:1258)
	at sun.reflect.NativeMethodAccessorImpl.invoke0(Native Method)
	at sun.reflect.NativeMethodAccessorImpl.invoke(NativeMethodAccessorImpl.java:39)
	at sun.reflect.DelegatingMethodAccessorImpl.invoke(DelegatingMethodAccessorImpl.java:25)
	at java.lang.reflect.Method.invoke(Method.java:324)
	at com.werken.forehead.Forehead.run(Forehead.java:551)
	at com.werken.forehead.Forehead.main(Forehead.java:581)
Invalid Redirect URI from: http://codehaus.org:80/~jgenender/maven2//geronimo/jars/geronimo-deployment-1.0-SNAPSHOT.jar to: http://www.codehaus.org/~jgenender/maven2//geronimo/jars/geronimo-deployment-1.0-SNAPSHOT.jar
Error retrieving artifact from [http://codehaus.org/~jgenender/maven2]: org.apache.maven.wagon.TransferFailedException: Failed to trasfer file: http://codehaus.org/~jgenender/maven2//geronimo/jars/geronimo-deployment-1.0-SNAPSHOT.jar. Return code is: 302
Attempting to download geronimo-j2ee-1.0-SNAPSHOT.jar.
Error getting URI host
org.apache.commons.httpclient.HttpException: Redirect from host codehaus.org to www.codehaus.org is not supported
	at org.apache.commons.httpclient.HttpMethodBase.checkValidRedirect(HttpMethodBase.java:1237)
	at org.apache.commons.httpclient.HttpMethodBase.processRedirectResponse(HttpMethodBase.java:1185)
	at org.apache.commons.httpclient.HttpMethodBase.isRetryNeeded(HttpMethodBase.java:967)
	at org.apache.commons.httpclient.HttpMethodBase.execute(HttpMethodBase.java:1089)
	at org.apache.commons.httpclient.HttpClient.executeMethod(HttpClient.java:643)
	at org.apache.commons.httpclient.HttpClient.executeMethod(HttpClient.java:497)
	at org.apache.maven.wagon.providers.http.HttpWagon.get(HttpWagon.java:287)
	at org.apache.maven.wagon.providers.http.HttpWagon.getIfNewer(HttpWagon.java:234)
	at org.apache.maven.verifier.DependencyVerifier.getRemoteArtifact(DependencyVerifier.java:391)
	at org.apache.maven.verifier.DependencyVerifier.getDependencies(DependencyVerifier.java:291)
	at org.apache.maven.verifier.DependencyVerifier.satisfyDependencies(DependencyVerifier.java:182)
	at org.apache.maven.verifier.DependencyVerifier.verify(DependencyVerifier.java:99)
	at org.apache.maven.project.Project.verifyDependencies(Project.java:569)
	at org.apache.maven.plugin.PluginManager.attainGoals(PluginManager.java:663)
	at org.apache.maven.MavenSession.attainGoals(MavenSession.java:263)
	at org.apache.maven.jelly.tags.maven.ReactorTag.doTag(ReactorTag.java:368)
	at org.apache.commons.jelly.impl.TagScript.run(TagScript.java:247)
	at org.apache.commons.jelly.impl.ScriptBlock.run(ScriptBlock.java:95)
	at org.apache.maven.jelly.tags.werkz.MavenGoalTag.runBodyTag(MavenGoalTag.java:78)
	at org.apache.maven.jelly.tags.werkz.MavenGoalTag$MavenGoalAction.performAction(MavenGoalTag.java:109)
	at org.apache.maven.werkz.Goal.fire(Goal.java:656)
	at org.apache.maven.werkz.Goal.attain(Goal.java:592)
	at org.apache.maven.plugin.PluginManager.attainGoals(PluginManager.java:693)
	at org.apache.maven.MavenSession.attainGoals(MavenSession.java:263)
	at org.apache.maven.cli.App.doMain(App.java:511)
	at org.apache.maven.cli.App.main(App.java:1258)
	at sun.reflect.NativeMethodAccessorImpl.invoke0(Native Method)
	at sun.reflect.NativeMethodAccessorImpl.invoke(NativeMethodAccessorImpl.java:39)
	at sun.reflect.DelegatingMethodAccessorImpl.invoke(DelegatingMethodAccessorImpl.java:25)
	at java.lang.reflect.Method.invoke(Method.java:324)
	at com.werken.forehead.Forehead.run(Forehead.java:551)
	at com.werken.forehead.Forehead.main(Forehead.java:581)
Invalid Redirect URI from: http://codehaus.org:80/~jgenender/maven2//geronimo/jars/geronimo-j2ee-1.0-SNAPSHOT.jar to: http://www.codehaus.org/~jgenender/maven2//geronimo/jars/geronimo-j2ee-1.0-SNAPSHOT.jar
Error retrieving artifact from [http://codehaus.org/~jgenender/maven2]: org.apache.maven.wagon.TransferFailedException: Failed to trasfer file: http://codehaus.org/~jgenender/maven2//geronimo/jars/geronimo-j2ee-1.0-SNAPSHOT.jar. Return code is: 302
Attempting to download geronimo-j2ee-schema-1.0-SNAPSHOT.jar.
Error getting URI host
org.apache.commons.httpclient.HttpException: Redirect from host codehaus.org to www.codehaus.org is not supported
	at org.apache.commons.httpclient.HttpMethodBase.checkValidRedirect(HttpMethodBase.java:1237)
	at org.apache.commons.httpclient.HttpMethodBase.processRedirectResponse(HttpMethodBase.java:1185)
	at org.apache.commons.httpclient.HttpMethodBase.isRetryNeeded(HttpMethodBase.java:967)
	at org.apache.commons.httpclient.HttpMethodBase.execute(HttpMethodBase.java:1089)
	at org.apache.commons.httpclient.HttpClient.executeMethod(HttpClient.java:643)
	at org.apache.commons.httpclient.HttpClient.executeMethod(HttpClient.java:497)
	at org.apache.maven.wagon.providers.http.HttpWagon.get(HttpWagon.java:287)
	at org.apache.maven.wagon.providers.http.HttpWagon.getIfNewer(HttpWagon.java:234)
	at org.apache.maven.verifier.DependencyVerifier.getRemoteArtifact(DependencyVerifier.java:391)
	at org.apache.maven.verifier.DependencyVerifier.getDependencies(DependencyVerifier.java:291)
	at org.apache.maven.verifier.DependencyVerifier.satisfyDependencies(DependencyVerifier.java:182)
	at org.apache.maven.verifier.DependencyVerifier.verify(DependencyVerifier.java:99)
	at org.apache.maven.project.Project.verifyDependencies(Project.java:569)
	at org.apache.maven.plugin.PluginManager.attainGoals(PluginManager.java:663)
	at org.apache.maven.MavenSession.attainGoals(MavenSession.java:263)
	at org.apache.maven.jelly.tags.maven.ReactorTag.doTag(ReactorTag.java:368)
	at org.apache.commons.jelly.impl.TagScript.run(TagScript.java:247)
	at org.apache.commons.jelly.impl.ScriptBlock.run(ScriptBlock.java:95)
	at org.apache.maven.jelly.tags.werkz.MavenGoalTag.runBodyTag(MavenGoalTag.java:78)
	at org.apache.maven.jelly.tags.werkz.MavenGoalTag$MavenGoalAction.performAction(MavenGoalTag.java:109)
	at org.apache.maven.werkz.Goal.fire(Goal.java:656)
	at org.apache.maven.werkz.Goal.attain(Goal.java:592)
	at org.apache.maven.plugin.PluginManager.attainGoals(PluginManager.java:693)
	at org.apache.maven.MavenSession.attainGoals(MavenSession.java:263)
	at org.apache.maven.cli.App.doMain(App.java:511)
	at org.apache.maven.cli.App.main(App.java:1258)
	at sun.reflect.NativeMethodAccessorImpl.invoke0(Native Method)
	at sun.reflect.NativeMethodAccessorImpl.invoke(NativeMethodAccessorImpl.java:39)
	at sun.reflect.DelegatingMethodAccessorImpl.invoke(DelegatingMethodAccessorImpl.java:25)
	at java.lang.reflect.Method.invoke(Method.java:324)
	at com.werken.forehead.Forehead.run(Forehead.java:551)
	at com.werken.forehead.Forehead.main(Forehead.java:581)
Invalid Redirect URI from: http://codehaus.org:80/~jgenender/maven2//geronimo/jars/geronimo-j2ee-schema-1.0-SNAPSHOT.jar to: http://www.codehaus.org/~jgenender/maven2//geronimo/jars/geronimo-j2ee-schema-1.0-SNAPSHOT.jar
Error retrieving artifact from [http://codehaus.org/~jgenender/maven2]: org.apache.maven.wagon.TransferFailedException: Failed to trasfer file: http://codehaus.org/~jgenender/maven2//geronimo/jars/geronimo-j2ee-schema-1.0-SNAPSHOT.jar. Return code is: 302
build:start:

multiproject:install-callback:
    [echo] Running jar:install for Geronimo :: Service :: Builder
java:prepare-filesystem:

java:compile:
<depend closure="false" srcdir="1.4" dump="false" destdir="/home/continuum/build/work/1/modules/service-builder/target/classes"></depend>    [echo] Compiling to /home/continuum/build/work/1/modules/service-builder/target/classes

java:jar-resources:

test:prepare-filesystem:

test:test-resources:

test:compile:

test:test:
    [echo] NOTICE: Skipping tests; they seem to have passed already
    [echo] No tests to run.
Running post goal: test:test

jar:jar:

jar:install:
    [echo] Installing...
Uploading to geronimo/jars/geronimo-service-builder-1.0-SNAPSHOT.jar: 
.................... (190K)
Uploading to geronimo/poms/geronimo-service-builder-1.0-SNAPSHOT.pom: 
.................... (11K)

+----------------------------------------
| geronimo and geronimo-plugins Geronimo :: Maven Dependency Plugin
| Memory: 13M/15M
+----------------------------------------
DEPRECATED: the default goal should be specified in the <build> section of project.xml instead of maven.xml

build:end:

Attempting to download geronimo-service-builder-1.0-SNAPSHOT.jar.
Artifact /geronimo/jars/geronimo-service-builder-1.0-SNAPSHOT.jar doesn't exist in remote repository, but it exists locally.
build:start:

multiproject:install-callback:
    [echo] Running plugin:repository-install for Geronimo :: Maven Dependency Plugin
plugin:plugin:
java:prepare-filesystem:

java:compile:
    [echo] Compiling to /home/continuum/build/work/1/plugins/geronimo-dependency-plugin/target/classes

java:jar-resources:

test:prepare-filesystem:

test:test-resources:

test:compile:
    [echo] No test source files to compile.

test:test:
    [echo] No tests to run.

jar:jar:


plugin:repository-install:
    [echo] Installing...
Uploading to geronimo/plugins/geronimo-dependency-plugin-1.1.0.jar: 
.................... (9K)
Uploading to geronimo/poms/geronimo-dependency-plugin-1.1.0.pom: 
.................... (1K)

+----------------------------------------
| geronimo and geronimo-plugins Geronimo :: Security
| Memory: 13M/15M
+----------------------------------------
DEPRECATED: the default goal should be specified in the <build> section of project.xml instead of maven.xml
DEPRECATED: the default goal should be specified in the <build> section of project.xml instead of maven.xml

build:end:

build:start:

multiproject:install-callback:
    [echo] Running jar:install for Geronimo :: Security
java:prepare-filesystem:

java:compile:
<depend closure="false" srcdir="1.4" dump="false" destdir="/home/continuum/build/work/1/modules/security/target/classes"></depend>    [echo] Compiling to /home/continuum/build/work/1/modules/security/target/classes

java:jar-resources:

test:prepare-filesystem:

test:test-resources:
Running post goal: test:test-resources
    [delete] Deleting directory /home/continuum/build/work/1/modules/security/target/database
    [mkdir] Created dir: /home/continuum/build/work/1/modules/security/target/database

test:compile:

test:test:
    [echo] NOTICE: Skipping tests; they seem to have passed already
    [echo] No tests to run.
Running post goal: test:test

jar:jar:

jar:install:
    [echo] Installing...
Uploading to geronimo/jars/geronimo-security-1.0-SNAPSHOT.jar: 
.................... (170K)
Uploading to geronimo/poms/geronimo-security-1.0-SNAPSHOT.pom: 
.................... (12K)

+----------------------------------------
| geronimo and geronimo-plugins Geronimo :: Web Services
| Memory: 10M/15M
+----------------------------------------
DEPRECATED: the default goal should be specified in the <build> section of project.xml instead of maven.xml

build:end:

build:start:

multiproject:install-callback:
    [echo] Running jar:install for Geronimo :: Web Services
java:prepare-filesystem:

java:compile:
<depend closure="false" srcdir="1.4" dump="false" destdir="/home/continuum/build/work/1/modules/webservices/target/classes"></depend>    [echo] Compiling to /home/continuum/build/work/1/modules/webservices/target/classes

java:jar-resources:

test:prepare-filesystem:

test:test-resources:

test:compile:
    [echo] No test source files to compile.

test:test:
    [echo] NOTICE: Skipping tests; they seem to have passed already
    [echo] No tests to run.
Running post goal: test:test

jar:jar:

jar:install:
    [echo] Installing...
Uploading to geronimo/jars/geronimo-webservices-1.0-SNAPSHOT.jar: 
.................... (34K)
Uploading to geronimo/poms/geronimo-webservices-1.0-SNAPSHOT.pom: 
.................... (11K)

+----------------------------------------
| geronimo and geronimo-plugins Geronimo :: Axis
| Memory: 10M/15M
+----------------------------------------
DEPRECATED: the default goal should be specified in the <build> section of project.xml instead of maven.xml
DEPRECATED: the default goal should be specified in the <build> section of project.xml instead of maven.xml

build:end:

Attempting to download geronimo-security-1.0-SNAPSHOT.jar.
Error getting URI host
org.apache.commons.httpclient.HttpException: Redirect from host codehaus.org to www.codehaus.org is not supported
	at org.apache.commons.httpclient.HttpMethodBase.checkValidRedirect(HttpMethodBase.java:1237)
	at org.apache.commons.httpclient.HttpMethodBase.processRedirectResponse(HttpMethodBase.java:1185)
	at org.apache.commons.httpclient.HttpMethodBase.isRetryNeeded(HttpMethodBase.java:967)
	at org.apache.commons.httpclient.HttpMethodBase.execute(HttpMethodBase.java:1089)
	at org.apache.commons.httpclient.HttpClient.executeMethod(HttpClient.java:643)
	at org.apache.commons.httpclient.HttpClient.executeMethod(HttpClient.java:497)
	at org.apache.maven.wagon.providers.http.HttpWagon.get(HttpWagon.java:287)
	at org.apache.maven.wagon.providers.http.HttpWagon.getIfNewer(HttpWagon.java:234)
	at org.apache.maven.verifier.DependencyVerifier.getRemoteArtifact(DependencyVerifier.java:391)
	at org.apache.maven.verifier.DependencyVerifier.getDependencies(DependencyVerifier.java:291)
	at org.apache.maven.verifier.DependencyVerifier.satisfyDependencies(DependencyVerifier.java:182)
	at org.apache.maven.verifier.DependencyVerifier.verify(DependencyVerifier.java:99)
	at org.apache.maven.project.Project.verifyDependencies(Project.java:569)
	at org.apache.maven.plugin.PluginManager.attainGoals(PluginManager.java:663)
	at org.apache.maven.MavenSession.attainGoals(MavenSession.java:263)
	at org.apache.maven.jelly.tags.maven.ReactorTag.doTag(ReactorTag.java:368)
	at org.apache.commons.jelly.impl.TagScript.run(TagScript.java:247)
	at org.apache.commons.jelly.impl.ScriptBlock.run(ScriptBlock.java:95)
	at org.apache.maven.jelly.tags.werkz.MavenGoalTag.runBodyTag(MavenGoalTag.java:78)
	at org.apache.maven.jelly.tags.werkz.MavenGoalTag$MavenGoalAction.performAction(MavenGoalTag.java:109)
	at org.apache.maven.werkz.Goal.fire(Goal.java:656)
	at org.apache.maven.werkz.Goal.attain(Goal.java:592)
	at org.apache.maven.plugin.PluginManager.attainGoals(PluginManager.java:693)
	at org.apache.maven.MavenSession.attainGoals(MavenSession.java:263)
	at org.apache.maven.cli.App.doMain(App.java:511)
	at org.apache.maven.cli.App.main(App.java:1258)
	at sun.reflect.NativeMethodAccessorImpl.invoke0(Native Method)
	at sun.reflect.NativeMethodAccessorImpl.invoke(NativeMethodAccessorImpl.java:39)
	at sun.reflect.DelegatingMethodAccessorImpl.invoke(DelegatingMethodAccessorImpl.java:25)
	at java.lang.reflect.Method.invoke(Method.java:324)
	at com.werken.forehead.Forehead.run(Forehead.java:551)
	at com.werken.forehead.Forehead.main(Forehead.java:581)
Invalid Redirect URI from: http://codehaus.org:80/~jgenender/maven2//geronimo/jars/geronimo-security-1.0-SNAPSHOT.jar to: http://www.codehaus.org/~jgenender/maven2//geronimo/jars/geronimo-security-1.0-SNAPSHOT.jar
Error retrieving artifact from [http://codehaus.org/~jgenender/maven2]: org.apache.maven.wagon.TransferFailedException: Failed to trasfer file: http://codehaus.org/~jgenender/maven2//geronimo/jars/geronimo-security-1.0-SNAPSHOT.jar. Return code is: 302
Attempting to download geronimo-webservices-1.0-SNAPSHOT.jar.
Error getting URI host
org.apache.commons.httpclient.HttpException: Redirect from host codehaus.org to www.codehaus.org is not supported
	at org.apache.commons.httpclient.HttpMethodBase.checkValidRedirect(HttpMethodBase.java:1237)
	at org.apache.commons.httpclient.HttpMethodBase.processRedirectResponse(HttpMethodBase.java:1185)
	at org.apache.commons.httpclient.HttpMethodBase.isRetryNeeded(HttpMethodBase.java:967)
	at org.apache.commons.httpclient.HttpMethodBase.execute(HttpMethodBase.java:1089)
	at org.apache.commons.httpclient.HttpClient.executeMethod(HttpClient.java:643)
	at org.apache.commons.httpclient.HttpClient.executeMethod(HttpClient.java:497)
	at org.apache.maven.wagon.providers.http.HttpWagon.get(HttpWagon.java:287)
	at org.apache.maven.wagon.providers.http.HttpWagon.getIfNewer(HttpWagon.java:234)
	at org.apache.maven.verifier.DependencyVerifier.getRemoteArtifact(DependencyVerifier.java:391)
	at org.apache.maven.verifier.DependencyVerifier.getDependencies(DependencyVerifier.java:291)
	at org.apache.maven.verifier.DependencyVerifier.satisfyDependencies(DependencyVerifier.java:182)
	at org.apache.maven.verifier.DependencyVerifier.verify(DependencyVerifier.java:99)
	at org.apache.maven.project.Project.verifyDependencies(Project.java:569)
	at org.apache.maven.plugin.PluginManager.attainGoals(PluginManager.java:663)
	at org.apache.maven.MavenSession.attainGoals(MavenSession.java:263)
	at org.apache.maven.jelly.tags.maven.ReactorTag.doTag(ReactorTag.java:368)
	at org.apache.commons.jelly.impl.TagScript.run(TagScript.java:247)
	at org.apache.commons.jelly.impl.ScriptBlock.run(ScriptBlock.java:95)
	at org.apache.maven.jelly.tags.werkz.MavenGoalTag.runBodyTag(MavenGoalTag.java:78)
	at org.apache.maven.jelly.tags.werkz.MavenGoalTag$MavenGoalAction.performAction(MavenGoalTag.java:109)
	at org.apache.maven.werkz.Goal.fire(Goal.java:656)
	at org.apache.maven.werkz.Goal.attain(Goal.java:592)
	at org.apache.maven.plugin.PluginManager.attainGoals(PluginManager.java:693)
	at org.apache.maven.MavenSession.attainGoals(MavenSession.java:263)
	at org.apache.maven.cli.App.doMain(App.java:511)
	at org.apache.maven.cli.App.main(App.java:1258)
	at sun.reflect.NativeMethodAccessorImpl.invoke0(Native Method)
	at sun.reflect.NativeMethodAccessorImpl.invoke(NativeMethodAccessorImpl.java:39)
	at sun.reflect.DelegatingMethodAccessorImpl.invoke(DelegatingMethodAccessorImpl.java:25)
	at java.lang.reflect.Method.invoke(Method.java:324)
	at com.werken.forehead.Forehead.run(Forehead.java:551)
	at com.werken.forehead.Forehead.main(Forehead.java:581)
Invalid Redirect URI from: http://codehaus.org:80/~jgenender/maven2//geronimo/jars/geronimo-webservices-1.0-SNAPSHOT.jar to: http://www.codehaus.org/~jgenender/maven2//geronimo/jars/geronimo-webservices-1.0-SNAPSHOT.jar
Error retrieving artifact from [http://codehaus.org/~jgenender/maven2]: org.apache.maven.wagon.TransferFailedException: Failed to trasfer file: http://codehaus.org/~jgenender/maven2//geronimo/jars/geronimo-webservices-1.0-SNAPSHOT.jar. Return code is: 302
Attempting to download axis-1.4-SNAPSHOT.jar.
1/1571K
2/1571K
5/1571K
6/1571K
8/1571K
9/1571K
11/1571K
15/1571K
15/1571K
16/1571K
18/1571K
22/1571K
23/1571K
27/1571K
30/1571K
33/1571K
35/1571K
39/1571K
40/1571K
42/1571K
43/1571K
44/1571K
47/1571K
49/1571K
52/1571K
53/1571K
57/1571K
57/1571K
60/1571K
61/1571K
63/1571K
66/1571K
67/1571K
68/1571K
72/1571K
73/1571K
76/1571K
77/1571K
78/1571K
81/1571K
84/1571K
87/1571K
88/1571K
90/1571K
91/1571K
93/1571K
94/1571K
97/1571K
100/1571K
102/1571K
105/1571K
109/1571K
109/1571K
111/1571K
112/1571K
116/1571K
117/1571K
118/1571K
119/1571K
121/1571K
125/1571K
126/1571K
128/1571K
129/1571K
131/1571K
132/1571K
134/1571K
138/1571K
138/1571K
139/1571K
141/1571K
142/1571K
143/1571K
145/1571K
146/1571K
150/1571K
152/1571K
153/1571K
155/1571K
158/1571K
160/1571K
162/1571K
165/1571K
166/1571K
169/1571K
170/1571K
172/1571K
173/1571K
175/1571K
176/1571K
177/1571K
181/1571K
182/1571K
183/1571K
184/1571K
186/1571K
190/1571K
190/1571K
194/1571K
194/1571K
197/1571K
200/1571K
201/1571K
204/1571K
207/1571K
208/1571K
210/1571K
214/1571K
214/1571K
218/1571K
221/1571K
223/1571K
225/1571K
227/1571K
228/1571K
230/1571K
231/1571K
235/1571K
237/1571K
238/1571K
240/1571K
242/1571K
244/1571K
248/1571K
248/1571K
249/1571K
253/1571K
254/1571K
255/1571K
259/1571K
259/1571K
263/1571K
264/1571K
265/1571K
266/1571K
269/1571K
272/1571K
274/1571K
275/1571K
278/1571K
279/1571K
281/1571K
282/1571K
283/1571K
285/1571K
289/1571K
289/1571K
290/1571K
293/1571K
295/1571K
296/1571K
298/1571K
299/1571K
302/1571K
305/1571K
307/1571K
310/1571K
313/1571K
316/1571K
319/1571K
323/1571K
324/1571K
326/1571K
327/1571K
330/1571K
332/1571K
333/1571K
334/1571K
336/1571K
339/1571K
341/1571K
343/1571K
346/1571K
348/1571K
350/1571K
353/1571K
356/1571K
358/1571K
360/1571K
363/1571K
364/1571K
365/1571K
369/1571K
370/1571K
371/1571K
373/1571K
374/1571K
375/1571K
379/1571K
380/1571K
381/1571K
384/1571K
387/1571K
389/1571K
393/1571K
394/1571K
395/1571K
397/1571K
398/1571K
399/1571K
401/1571K
405/1571K
406/1571K
409/1571K
411/1571K
412/1571K
415/1571K
418/1571K
419/1571K
421/1571K
423/1571K
425/1571K
426/1571K
428/1571K
429/1571K
430/1571K
433/1571K
435/1571K
436/1571K
438/1571K
442/1571K
446/1571K
446/1571K
450/1571K
450/1571K
452/1571K
456/1571K
456/1571K
457/1571K
459/1571K
462/1571K
463/1571K
467/1571K
467/1571K
469/1571K
470/1571K
473/1571K
474/1571K
478/1571K
481/1571K
485/1571K
486/1571K
487/1571K
490/1571K
491/1571K
493/1571K
496/1571K
500/1571K
500/1571K
503/1571K
504/1571K
505/1571K
507/1571K
508/1571K
511/1571K
514/1571K
515/1571K
518/1571K
520/1571K
521/1571K
522/1571K
525/1571K
528/1571K
529/1571K
531/1571K
535/1571K
537/1571K
538/1571K
541/1571K
542/1571K
544/1571K
545/1571K
546/1571K
550/1571K
551/1571K
552/1571K
554/1571K
555/1571K
556/1571K
558/1571K
559/1571K
561/1571K
562/1571K
563/1571K
565/1571K
566/1571K
568/1571K
569/1571K
572/1571K
573/1571K
575/1571K
578/1571K
579/1571K
583/1571K
585/1571K
587/1571K
589/1571K
592/1571K
593/1571K
595/1571K
596/1571K
597/1571K
600/1571K
603/1571K
606/1571K
607/1571K
609/1571K
611/1571K
615/1571K
616/1571K
617/1571K
619/1571K
623/1571K
624/1571K
627/1571K
631/1571K
631/1571K
633/1571K
634/1571K
636/1571K
637/1571K
638/1571K
640/1571K
641/1571K
643/1571K
644/1571K
645/1571K
647/1571K
650/1571K
652/1571K
654/1571K
658/1571K
658/1571K
660/1571K
662/1571K
664/1571K
665/1571K
669/1571K
671/1571K
674/1571K
677/1571K
678/1571K
681/1571K
682/1571K
684/1571K
685/1571K
686/1571K
688/1571K
689/1571K
691/1571K
692/1571K
695/1571K
696/1571K
698/1571K
699/1571K
702/1571K
703/1571K
705/1571K
708/1571K
710/1571K
712/1571K
713/1571K
715/1571K
719/1571K
720/1571K
722/1571K
723/1571K
725/1571K
726/1571K
730/1571K
732/1571K
733/1571K
735/1571K
736/1571K
737/1571K
739/1571K
740/1571K
743/1571K
744/1571K
746/1571K
747/1571K
749/1571K
750/1571K
754/1571K
754/1571K
756/1571K
757/1571K
759/1571K
760/1571K
761/1571K
763/1571K
764/1571K
766/1571K
770/1571K
770/1571K
774/1571K
774/1571K
776/1571K
780/1571K
780/1571K
781/1571K
783/1571K
784/1571K
785/1571K
787/1571K
788/1571K
790/1571K
791/1571K
792/1571K
794/1571K
797/1571K
801/1571K
801/1571K
804/1571K
805/1571K
807/1571K
811/1571K
814/1571K
815/1571K
817/1571K
818/1571K
819/1571K
822/1571K
825/1571K
826/1571K
828/1571K
829/1571K
831/1571K
832/1571K
835/1571K
836/1571K
838/1571K
842/1571K
842/1571K
843/1571K
847/1571K
849/1571K
850/1571K
853/1571K
855/1571K
856/1571K
859/1571K
863/1571K
867/1571K
871/1571K
872/1571K
875/1571K
877/1571K
879/1571K
880/1571K
883/1571K
884/1571K
887/1571K
889/1571K
891/1571K
894/1571K
896/1571K
897/1571K
899/1571K
900/1571K
901/1571K
903/1571K
904/1571K
908/1571K
910/1571K
911/1571K
914/1571K
918/1571K
918/1571K
920/1571K
921/1571K
923/1571K
924/1571K
925/1571K
927/1571K
928/1571K
930/1571K
932/1571K
934/1571K
937/1571K
941/1571K
941/1571K
942/1571K
944/1571K
947/1571K
948/1571K
951/1571K
952/1571K
954/1571K
955/1571K
957/1571K
959/1571K
962/1571K
966/1571K
966/1571K
970/1571K
971/1571K
972/1571K
973/1571K
975/1571K
976/1571K
979/1571K
982/1571K
985/1571K
988/1571K
989/1571K
992/1571K
995/1571K
996/1571K
998/1571K
999/1571K
1003/1571K
1007/1571K
1007/1571K
1009/1571K
1010/1571K
1013/1571K
1014/1571K
1017/1571K
1019/1571K
1020/1571K
1023/1571K
1024/1571K
1026/1571K
1029/1571K
1030/1571K
1033/1571K
1034/1571K
1037/1571K
1039/1571K
1043/1571K
1043/1571K
1046/1571K
1047/1571K
1048/1571K
1051/1571K
1053/1571K
1054/1571K
1056/1571K
1057/1571K
1058/1571K
1060/1571K
1064/1571K
1064/1571K
1065/1571K
1067/1571K
1068/1571K
1070/1571K
1071/1571K
1072/1571K
1074/1571K
1075/1571K
1077/1571K
1080/1571K
1082/1571K
1084/1571K
1085/1571K
1088/1571K
1092/1571K
1094/1571K
1095/1571K
1097/1571K
1098/1571K
1099/1571K
1101/1571K
1102/1571K
1104/1571K
1105/1571K
1106/1571K
1109/1571K
1111/1571K
1113/1571K
1115/1571K
1116/1571K
1118/1571K
1119/1571K
1121/1571K
1122/1571K
1126/1571K
1129/1571K
1130/1571K
1132/1571K
1133/1571K
1135/1571K
1139/1571K
1142/1571K
1143/1571K
1145/1571K
1147/1571K
1149/1571K
1150/1571K
1152/1571K
1154/1571K
1156/1571K
1159/1571K
1162/1571K
1163/1571K
1164/1571K
1166/1571K
1169/1571K
1170/1571K
1171/1571K
1174/1571K
1176/1571K
1180/1571K
1181/1571K
1183/1571K
1184/1571K
1186/1571K
1187/1571K
1188/1571K
1192/1571K
1194/1571K
1195/1571K
1197/1571K
1200/1571K
1201/1571K
1203/1571K
1204/1571K
1207/1571K
1208/1571K
1210/1571K
1211/1571K
1212/1571K
1214/1571K
1217/1571K
1221/1571K
1221/1571K
1224/1571K
1227/1571K
1228/1571K
1231/1571K
1232/1571K
1234/1571K
1235/1571K
1237/1571K
1238/1571K
1239/1571K
1241/1571K
1242/1571K
1244/1571K
1245/1571K
1246/1571K
1248/1571K
1249/1571K
1251/1571K
1253/1571K
1256/1571K
1260/1571K
1261/1571K
1262/1571K
1263/1571K
1265/1571K
1268/1571K
1270/1571K
1273/1571K
1275/1571K
1276/1571K
1279/1571K
1280/1571K
1284/1571K
1285/1571K
1286/1571K
1289/1571K
1292/1571K
1293/1571K
1294/1571K
1297/1571K
1301/1571K
1302/1571K
1303/1571K
1306/1571K
1307/1571K
1311/1571K
1311/1571K
1313/1571K
1314/1571K
1318/1571K
1320/1571K
1321/1571K
1323/1571K
1324/1571K
1326/1571K
1327/1571K
1331/1571K
1333/1571K
1334/1571K
1335/1571K
1338/1571K
1340/1571K
1341/1571K
1343/1571K
1344/1571K
1345/1571K
1348/1571K
1350/1571K
1352/1571K
1354/1571K
1355/1571K
1357/1571K
1358/1571K
1362/1571K
1364/1571K
1367/1571K
1368/1571K
1369/1571K
1372/1571K
1374/1571K
1375/1571K
1376/1571K
1379/1571K
1381/1571K
1382/1571K
1385/1571K
1389/1571K
1389/1571K
1391/1571K
1392/1571K
1393/1571K
1397/1571K
1398/1571K
1401/1571K
1405/1571K
1409/1571K
1409/1571K
1412/1571K
1413/1571K
1415/1571K
1416/1571K
1418/1571K
1420/1571K
1422/1571K
1425/1571K
1429/1571K
1429/1571K
1432/1571K
1433/1571K
1434/1571K
1436/1571K
1437/1571K
1439/1571K
1442/1571K
1443/1571K
1446/1571K
1450/1571K
1450/1571K
1453/1571K
1454/1571K
1456/1571K
1459/1571K
1461/1571K
1463/1571K
1464/1571K
1467/1571K
1470/1571K
1471/1571K
1473/1571K
1474/1571K
1478/1571K
1481/1571K
1485/1571K
1485/1571K
1488/1571K
1490/1571K
1492/1571K
1494/1571K
1497/1571K
1498/1571K
1502/1571K
1502/1571K
1504/1571K
1508/1571K
1509/1571K
1511/1571K
1512/1571K
1514/1571K
1515/1571K
1519/1571K
1521/1571K
1525/1571K
1525/1571K
1529/1571K
1532/1571K
1533/1571K
1535/1571K
1536/1571K
1538/1571K
1539/1571K
1541/1571K
1543/1571K
1545/1571K
1546/1571K
1548/1571K
1550/1571K
1552/1571K
1555/1571K
1559/1571K
1560/1571K
1562/1571K
1566/1571K
1566/1571K
1567/1571K
1571/1571K
1571K downloaded
Error getting URI host
org.apache.commons.httpclient.HttpException: Redirect from host codehaus.org to www.codehaus.org is not supported
	at org.apache.commons.httpclient.HttpMethodBase.checkValidRedirect(HttpMethodBase.java:1237)
	at org.apache.commons.httpclient.HttpMethodBase.processRedirectResponse(HttpMethodBase.java:1185)
	at org.apache.commons.httpclient.HttpMethodBase.isRetryNeeded(HttpMethodBase.java:967)
	at org.apache.commons.httpclient.HttpMethodBase.execute(HttpMethodBase.java:1089)
	at org.apache.commons.httpclient.HttpClient.executeMethod(HttpClient.java:643)
	at org.apache.commons.httpclient.HttpClient.executeMethod(HttpClient.java:497)
	at org.apache.maven.wagon.providers.http.HttpWagon.get(HttpWagon.java:287)
	at org.apache.maven.wagon.providers.http.HttpWagon.getIfNewer(HttpWagon.java:234)
	at org.apache.maven.verifier.DependencyVerifier.getRemoteArtifact(DependencyVerifier.java:391)
	at org.apache.maven.verifier.DependencyVerifier.getDependencies(DependencyVerifier.java:291)
	at org.apache.maven.verifier.DependencyVerifier.satisfyDependencies(DependencyVerifier.java:182)
	at org.apache.maven.verifier.DependencyVerifier.verify(DependencyVerifier.java:99)
	at org.apache.maven.project.Project.verifyDependencies(Project.java:569)
	at org.apache.maven.plugin.PluginManager.attainGoals(PluginManager.java:663)
	at org.apache.maven.MavenSession.attainGoals(MavenSession.java:263)
	at org.apache.maven.jelly.tags.maven.ReactorTag.doTag(ReactorTag.java:368)
	at org.apache.commons.jelly.impl.TagScript.run(TagScript.java:247)
	at org.apache.commons.jelly.impl.ScriptBlock.run(ScriptBlock.java:95)
	at org.apache.maven.jelly.tags.werkz.MavenGoalTag.runBodyTag(MavenGoalTag.java:78)
	at org.apache.maven.jelly.tags.werkz.MavenGoalTag$MavenGoalAction.performAction(MavenGoalTag.java:109)
	at org.apache.maven.werkz.Goal.fire(Goal.java:656)
	at org.apache.maven.werkz.Goal.attain(Goal.java:592)
	at org.apache.maven.plugin.PluginManager.attainGoals(PluginManager.java:693)
	at org.apache.maven.MavenSession.attainGoals(MavenSession.java:263)
	at org.apache.maven.cli.App.doMain(App.java:511)
	at org.apache.maven.cli.App.main(App.java:1258)
	at sun.reflect.NativeMethodAccessorImpl.invoke0(Native Method)
	at sun.reflect.NativeMethodAccessorImpl.invoke(NativeMethodAccessorImpl.java:39)
	at sun.reflect.DelegatingMethodAccessorImpl.invoke(DelegatingMethodAccessorImpl.java:25)
	at java.lang.reflect.Method.invoke(Method.java:324)
	at com.werken.forehead.Forehead.run(Forehead.java:551)
	at com.werken.forehead.Forehead.main(Forehead.java:581)
Invalid Redirect URI from: http://codehaus.org:80/~jgenender/maven2//axis/jars/axis-1.4-SNAPSHOT.jar to: http://www.codehaus.org/~jgenender/maven2//axis/jars/axis-1.4-SNAPSHOT.jar
Error retrieving artifact from [http://codehaus.org/~jgenender/maven2]: org.apache.maven.wagon.TransferFailedException: Failed to trasfer file: http://codehaus.org/~jgenender/maven2//axis/jars/axis-1.4-SNAPSHOT.jar. Return code is: 302
build:start:

multiproject:install-callback:
    [echo] Running jar:install for Geronimo :: Axis
java:prepare-filesystem:

java:compile:
<depend closure="false" srcdir="1.4" dump="false" destdir="/home/continuum/build/work/1/modules/axis/target/classes"></depend>    [echo] Compiling to /home/continuum/build/work/1/modules/axis/target/classes
Running post goal: java:compile
geronimo:dependency:


java:jar-resources:
Copying 1 file to /home/continuum/build/work/1/modules/axis/target/classes

test:prepare-filesystem:

test:test-resources:

test:compile:

test:test:
    [echo] NOTICE: Skipping tests; they seem to have passed already
    [echo] No tests to run.
Running post goal: test:test

jar:jar:
    [jar] Building jar: /home/continuum/build/work/1/modules/axis/target/geronimo-axis-1.0-SNAPSHOT.jar

jar:install:
    [echo] Installing...
Uploading to geronimo/jars/geronimo-axis-1.0-SNAPSHOT.jar: 
.................... (39K)
Uploading to geronimo/poms/geronimo-axis-1.0-SNAPSHOT.pom: 
.................... (12K)

+----------------------------------------
| geronimo and geronimo-plugins Geronimo :: Naming
| Memory: 11M/16M
+----------------------------------------
DEPRECATED: the default goal should be specified in the <build> section of project.xml instead of maven.xml
DEPRECATED: the default goal should be specified in the <build> section of project.xml instead of maven.xml

build:end:

build:start:

multiproject:install-callback:
    [echo] Running jar:install for Geronimo :: Naming
java:prepare-filesystem:

java:compile:
<depend closure="false" srcdir="1.4" dump="false" destdir="/home/continuum/build/work/1/modules/naming/target/classes"></depend>    [echo] Compiling to /home/continuum/build/work/1/modules/naming/target/classes

java:jar-resources:

test:prepare-filesystem:

test:test-resources:

test:compile:

test:test:
    [echo] NOTICE: Skipping tests; they seem to have passed already
    [echo] No tests to run.
Running post goal: test:test

jar:jar:

jar:install:
    [echo] Installing...
Uploading to geronimo/jars/geronimo-naming-1.0-SNAPSHOT.jar: 
.................... (45K)
Uploading to geronimo/poms/geronimo-naming-1.0-SNAPSHOT.pom: 
.................... (9K)

+----------------------------------------
| geronimo and geronimo-plugins Geronimo :: Deploy :: Common Config
| Memory: 11M/16M
+----------------------------------------
DEPRECATED: the default goal should be specified in the <build> section of project.xml instead of maven.xml
DEPRECATED: the default goal should be specified in the <build> section of project.xml instead of maven.xml

build:end:

build:start:

multiproject:install-callback:
    [echo] Running jar:install for Geronimo :: Deploy :: Common Config
java:prepare-filesystem:

java:compile:
<depend closure="false" srcdir="1.4" dump="false" destdir="/home/continuum/build/work/1/modules/deploy-config/target/classes"></depend>    [echo] Compiling to /home/continuum/build/work/1/modules/deploy-config/target/classes

java:jar-resources:

test:prepare-filesystem:

test:test-resources:

test:compile:

test:test:
    [echo] NOTICE: Skipping tests; they seem to have passed already
    [echo] No tests to run.
Running post goal: test:test

jar:jar:

jar:install:
    [echo] Installing...
Uploading to geronimo/jars/geronimo-deploy-config-1.0-SNAPSHOT.jar: 
.................... (10K)
Uploading to geronimo/poms/geronimo-deploy-config-1.0-SNAPSHOT.pom: 
.................... (10K)

+----------------------------------------
| geronimo and geronimo-plugins Geronimo :: Test :: DDBeans
| Memory: 10M/16M
+----------------------------------------
DEPRECATED: the default goal should be specified in the <build> section of project.xml instead of maven.xml
DEPRECATED: the default goal should be specified in the <build> section of project.xml instead of maven.xml

build:end:

build:start:

multiproject:install-callback:
    [echo] Running jar:install for Geronimo :: Test :: DDBeans
java:prepare-filesystem:

java:compile:
<depend closure="false" srcdir="1.4" dump="false" destdir="/home/continuum/build/work/1/modules/test-ddbean/target/classes"></depend>    [echo] Compiling to /home/continuum/build/work/1/modules/test-ddbean/target/classes

java:jar-resources:

test:prepare-filesystem:

test:test-resources:

test:compile:

test:test:
    [echo] NOTICE: Skipping tests; they seem to have passed already
    [echo] No tests to run.
Running post goal: test:test

jar:jar:

jar:install:
    [echo] Installing...
Uploading to geronimo/jars/geronimo-test-ddbean-1.0-SNAPSHOT.jar: 
.................... (17K)
Uploading to geronimo/poms/geronimo-test-ddbean-1.0-SNAPSHOT.pom: 
.................... (10K)

+----------------------------------------
| geronimo and geronimo-plugins Geronimo :: Transaction
| Memory: 11M/16M
+----------------------------------------
DEPRECATED: the default goal should be specified in the <build> section of project.xml instead of maven.xml

build:end:

build:start:

multiproject:install-callback:
    [echo] Running jar:install for Geronimo :: Transaction
java:prepare-filesystem:

java:compile:
<depend closure="false" srcdir="1.4" dump="false" destdir="/home/continuum/build/work/1/modules/transaction/target/classes"></depend>    [echo] Compiling to /home/continuum/build/work/1/modules/transaction/target/classes

java:jar-resources:

test:prepare-filesystem:

test:test-resources:

test:compile:

test:test:
    [echo] NOTICE: Skipping tests; they seem to have passed already
    [echo] No tests to run.
Running post goal: test:test

jar:jar:

jar:install:
    [echo] Installing...
Uploading to geronimo/jars/geronimo-transaction-1.0-SNAPSHOT.jar: 
.................... (73K)
Uploading to geronimo/poms/geronimo-transaction-1.0-SNAPSHOT.pom: 
.................... (11K)

+----------------------------------------
| geronimo and geronimo-plugins Geronimo :: Connector
| Memory: 12M/16M
+----------------------------------------
DEPRECATED: the default goal should be specified in the <build> section of project.xml instead of maven.xml
DEPRECATED: the default goal should be specified in the <build> section of project.xml instead of maven.xml

build:end:

Attempting to download geronimo-naming-1.0-SNAPSHOT.jar.
Error getting URI host
org.apache.commons.httpclient.HttpException: Redirect from host codehaus.org to www.codehaus.org is not supported
	at org.apache.commons.httpclient.HttpMethodBase.checkValidRedirect(HttpMethodBase.java:1237)
	at org.apache.commons.httpclient.HttpMethodBase.processRedirectResponse(HttpMethodBase.java:1185)
	at org.apache.commons.httpclient.HttpMethodBase.isRetryNeeded(HttpMethodBase.java:967)
	at org.apache.commons.httpclient.HttpMethodBase.execute(HttpMethodBase.java:1089)
	at org.apache.commons.httpclient.HttpClient.executeMethod(HttpClient.java:643)
	at org.apache.commons.httpclient.HttpClient.executeMethod(HttpClient.java:497)
	at org.apache.maven.wagon.providers.http.HttpWagon.get(HttpWagon.java:287)
	at org.apache.maven.wagon.providers.http.HttpWagon.getIfNewer(HttpWagon.java:234)
	at org.apache.maven.verifier.DependencyVerifier.getRemoteArtifact(DependencyVerifier.java:391)
	at org.apache.maven.verifier.DependencyVerifier.getDependencies(DependencyVerifier.java:291)
	at org.apache.maven.verifier.DependencyVerifier.satisfyDependencies(DependencyVerifier.java:182)
	at org.apache.maven.verifier.DependencyVerifier.verify(DependencyVerifier.java:99)
	at org.apache.maven.project.Project.verifyDependencies(Project.java:569)
	at org.apache.maven.plugin.PluginManager.attainGoals(PluginManager.java:663)
	at org.apache.maven.MavenSession.attainGoals(MavenSession.java:263)
	at org.apache.maven.jelly.tags.maven.ReactorTag.doTag(ReactorTag.java:368)
	at org.apache.commons.jelly.impl.TagScript.run(TagScript.java:247)
	at org.apache.commons.jelly.impl.ScriptBlock.run(ScriptBlock.java:95)
	at org.apache.maven.jelly.tags.werkz.MavenGoalTag.runBodyTag(MavenGoalTag.java:78)
	at org.apache.maven.jelly.tags.werkz.MavenGoalTag$MavenGoalAction.performAction(MavenGoalTag.java:109)
	at org.apache.maven.werkz.Goal.fire(Goal.java:656)
	at org.apache.maven.werkz.Goal.attain(Goal.java:592)
	at org.apache.maven.plugin.PluginManager.attainGoals(PluginManager.java:693)
	at org.apache.maven.MavenSession.attainGoals(MavenSession.java:263)
	at org.apache.maven.cli.App.doMain(App.java:511)
	at org.apache.maven.cli.App.main(App.java:1258)
	at sun.reflect.NativeMethodAccessorImpl.invoke0(Native Method)
	at sun.reflect.NativeMethodAccessorImpl.invoke(NativeMethodAccessorImpl.java:39)
	at sun.reflect.DelegatingMethodAccessorImpl.invoke(DelegatingMethodAccessorImpl.java:25)
	at java.lang.reflect.Method.invoke(Method.java:324)
	at com.werken.forehead.Forehead.run(Forehead.java:551)
	at com.werken.forehead.Forehead.main(Forehead.java:581)
Invalid Redirect URI from: http://codehaus.org:80/~jgenender/maven2//geronimo/jars/geronimo-naming-1.0-SNAPSHOT.jar to: http://www.codehaus.org/~jgenender/maven2//geronimo/jars/geronimo-naming-1.0-SNAPSHOT.jar
Error retrieving artifact from [http://codehaus.org/~jgenender/maven2]: org.apache.maven.wagon.TransferFailedException: Failed to trasfer file: http://codehaus.org/~jgenender/maven2//geronimo/jars/geronimo-naming-1.0-SNAPSHOT.jar. Return code is: 302
Attempting to download geronimo-transaction-1.0-SNAPSHOT.jar.
Error getting URI host
org.apache.commons.httpclient.HttpException: Redirect from host codehaus.org to www.codehaus.org is not supported
	at org.apache.commons.httpclient.HttpMethodBase.checkValidRedirect(HttpMethodBase.java:1237)
	at org.apache.commons.httpclient.HttpMethodBase.processRedirectResponse(HttpMethodBase.java:1185)
	at org.apache.commons.httpclient.HttpMethodBase.isRetryNeeded(HttpMethodBase.java:967)
	at org.apache.commons.httpclient.HttpMethodBase.execute(HttpMethodBase.java:1089)
	at org.apache.commons.httpclient.HttpClient.executeMethod(HttpClient.java:643)
	at org.apache.commons.httpclient.HttpClient.executeMethod(HttpClient.java:497)
	at org.apache.maven.wagon.providers.http.HttpWagon.get(HttpWagon.java:287)
	at org.apache.maven.wagon.providers.http.HttpWagon.getIfNewer(HttpWagon.java:234)
	at org.apache.maven.verifier.DependencyVerifier.getRemoteArtifact(DependencyVerifier.java:391)
	at org.apache.maven.verifier.DependencyVerifier.getDependencies(DependencyVerifier.java:291)
	at org.apache.maven.verifier.DependencyVerifier.satisfyDependencies(DependencyVerifier.java:182)
	at org.apache.maven.verifier.DependencyVerifier.verify(DependencyVerifier.java:99)
	at org.apache.maven.project.Project.verifyDependencies(Project.java:569)
	at org.apache.maven.plugin.PluginManager.attainGoals(PluginManager.java:663)
	at org.apache.maven.MavenSession.attainGoals(MavenSession.java:263)
	at org.apache.maven.jelly.tags.maven.ReactorTag.doTag(ReactorTag.java:368)
	at org.apache.commons.jelly.impl.TagScript.run(TagScript.java:247)
	at org.apache.commons.jelly.impl.ScriptBlock.run(ScriptBlock.java:95)
	at org.apache.maven.jelly.tags.werkz.MavenGoalTag.runBodyTag(MavenGoalTag.java:78)
	at org.apache.maven.jelly.tags.werkz.MavenGoalTag$MavenGoalAction.performAction(MavenGoalTag.java:109)
	at org.apache.maven.werkz.Goal.fire(Goal.java:656)
	at org.apache.maven.werkz.Goal.attain(Goal.java:592)
	at org.apache.maven.plugin.PluginManager.attainGoals(PluginManager.java:693)
	at org.apache.maven.MavenSession.attainGoals(MavenSession.java:263)
	at org.apache.maven.cli.App.doMain(App.java:511)
	at org.apache.maven.cli.App.main(App.java:1258)
	at sun.reflect.NativeMethodAccessorImpl.invoke0(Native Method)
	at sun.reflect.NativeMethodAccessorImpl.invoke(NativeMethodAccessorImpl.java:39)
	at sun.reflect.DelegatingMethodAccessorImpl.invoke(DelegatingMethodAccessorImpl.java:25)
	at java.lang.reflect.Method.invoke(Method.java:324)
	at com.werken.forehead.Forehead.run(Forehead.java:551)
	at com.werken.forehead.Forehead.main(Forehead.java:581)
Invalid Redirect URI from: http://codehaus.org:80/~jgenender/maven2//geronimo/jars/geronimo-transaction-1.0-SNAPSHOT.jar to: http://www.codehaus.org/~jgenender/maven2//geronimo/jars/geronimo-transaction-1.0-SNAPSHOT.jar
Error retrieving artifact from [http://codehaus.org/~jgenender/maven2]: org.apache.maven.wagon.TransferFailedException: Failed to trasfer file: http://codehaus.org/~jgenender/maven2//geronimo/jars/geronimo-transaction-1.0-SNAPSHOT.jar. Return code is: 302
build:start:

multiproject:install-callback:
    [echo] Running jar:install for Geronimo :: Connector
java:prepare-filesystem:

java:compile:
<depend closure="false" srcdir="1.4" dump="false" destdir="/home/continuum/build/work/1/modules/connector/target/classes"></depend>    [echo] Compiling to /home/continuum/build/work/1/modules/connector/target/classes

java:jar-resources:

test:prepare-filesystem:

test:test-resources:

test:compile:

test:test:
    [echo] NOTICE: Skipping tests; they seem to have passed already
    [echo] No tests to run.
Running post goal: test:test

jar:jar:

jar:install:
    [echo] Installing...
Uploading to geronimo/jars/geronimo-connector-1.0-SNAPSHOT.jar: 
.................... (128K)
Uploading to geronimo/poms/geronimo-connector-1.0-SNAPSHOT.pom: 
.................... (12K)

+----------------------------------------
| geronimo and geronimo-plugins Geronimo :: Security :: Builder
| Memory: 14M/16M
+----------------------------------------
DEPRECATED: the default goal should be specified in the <build> section of project.xml instead of maven.xml
DEPRECATED: the default goal should be specified in the <build> section of project.xml instead of maven.xml

build:end:

Attempting to download geronimo-deploy-config-1.0-SNAPSHOT.jar.
Error getting URI host
org.apache.commons.httpclient.HttpException: Redirect from host codehaus.org to www.codehaus.org is not supported
	at org.apache.commons.httpclient.HttpMethodBase.checkValidRedirect(HttpMethodBase.java:1237)
	at org.apache.commons.httpclient.HttpMethodBase.processRedirectResponse(HttpMethodBase.java:1185)
	at org.apache.commons.httpclient.HttpMethodBase.isRetryNeeded(HttpMethodBase.java:967)
	at org.apache.commons.httpclient.HttpMethodBase.execute(HttpMethodBase.java:1089)
	at org.apache.commons.httpclient.HttpClient.executeMethod(HttpClient.java:643)
	at org.apache.commons.httpclient.HttpClient.executeMethod(HttpClient.java:497)
	at org.apache.maven.wagon.providers.http.HttpWagon.get(HttpWagon.java:287)
	at org.apache.maven.wagon.providers.http.HttpWagon.getIfNewer(HttpWagon.java:234)
	at org.apache.maven.verifier.DependencyVerifier.getRemoteArtifact(DependencyVerifier.java:391)
	at org.apache.maven.verifier.DependencyVerifier.getDependencies(DependencyVerifier.java:291)
	at org.apache.maven.verifier.DependencyVerifier.satisfyDependencies(DependencyVerifier.java:182)
	at org.apache.maven.verifier.DependencyVerifier.verify(DependencyVerifier.java:99)
	at org.apache.maven.project.Project.verifyDependencies(Project.java:569)
	at org.apache.maven.plugin.PluginManager.attainGoals(PluginManager.java:663)
	at org.apache.maven.MavenSession.attainGoals(MavenSession.java:263)
	at org.apache.maven.jelly.tags.maven.ReactorTag.doTag(ReactorTag.java:368)
	at org.apache.commons.jelly.impl.TagScript.run(TagScript.java:247)
	at org.apache.commons.jelly.impl.ScriptBlock.run(ScriptBlock.java:95)
	at org.apache.maven.jelly.tags.werkz.MavenGoalTag.runBodyTag(MavenGoalTag.java:78)
	at org.apache.maven.jelly.tags.werkz.MavenGoalTag$MavenGoalAction.performAction(MavenGoalTag.java:109)
	at org.apache.maven.werkz.Goal.fire(Goal.java:656)
	at org.apache.maven.werkz.Goal.attain(Goal.java:592)
	at org.apache.maven.plugin.PluginManager.attainGoals(PluginManager.java:693)
	at org.apache.maven.MavenSession.attainGoals(MavenSession.java:263)
	at org.apache.maven.cli.App.doMain(App.java:511)
	at org.apache.maven.cli.App.main(App.java:1258)
	at sun.reflect.NativeMethodAccessorImpl.invoke0(Native Method)
	at sun.reflect.NativeMethodAccessorImpl.invoke(NativeMethodAccessorImpl.java:39)
	at sun.reflect.DelegatingMethodAccessorImpl.invoke(DelegatingMethodAccessorImpl.java:25)
	at java.lang.reflect.Method.invoke(Method.java:324)
	at com.werken.forehead.Forehead.run(Forehead.java:551)
	at com.werken.forehead.Forehead.main(Forehead.java:581)
Invalid Redirect URI from: http://codehaus.org:80/~jgenender/maven2//geronimo/jars/geronimo-deploy-config-1.0-SNAPSHOT.jar to: http://www.codehaus.org/~jgenender/maven2//geronimo/jars/geronimo-deploy-config-1.0-SNAPSHOT.jar
Error retrieving artifact from [http://codehaus.org/~jgenender/maven2]: org.apache.maven.wagon.TransferFailedException: Failed to trasfer file: http://codehaus.org/~jgenender/maven2//geronimo/jars/geronimo-deploy-config-1.0-SNAPSHOT.jar. Return code is: 302
build:start:

multiproject:install-callback:
    [echo] Running jar:install for Geronimo :: Security :: Builder
java:prepare-filesystem:

java:compile:
<depend closure="false" srcdir="1.4" dump="false" destdir="/home/continuum/build/work/1/modules/security-builder/target/classes"></depend>    [echo] Compiling to /home/continuum/build/work/1/modules/security-builder/target/classes

java:jar-resources:

test:prepare-filesystem:

test:test-resources:
Running post goal: test:test-resources
    [delete] Deleting directory /home/continuum/build/work/1/modules/security-builder/target/database
    [mkdir] Created dir: /home/continuum/build/work/1/modules/security-builder/target/database

test:compile:
    [echo] No test source files to compile.

test:test:
    [echo] NOTICE: Skipping tests; they seem to have passed already
    [echo] No tests to run.
Running post goal: test:test

jar:jar:

jar:install:
    [echo] Installing...
Uploading to geronimo/jars/geronimo-security-builder-1.0-SNAPSHOT.jar: 
.................... (173K)
Uploading to geronimo/poms/geronimo-security-builder-1.0-SNAPSHOT.pom: 
.................... (11K)

+----------------------------------------
| geronimo and geronimo-plugins Geronimo :: J2EE
| Memory: 14M/16M
+----------------------------------------
DEPRECATED: the default goal should be specified in the <build> section of project.xml instead of maven.xml
DEPRECATED: the default goal should be specified in the <build> section of project.xml instead of maven.xml

build:end:

Attempting to download geronimo-security-builder-1.0-SNAPSHOT.jar.
Error getting URI host
org.apache.commons.httpclient.HttpException: Redirect from host codehaus.org to www.codehaus.org is not supported
	at org.apache.commons.httpclient.HttpMethodBase.checkValidRedirect(HttpMethodBase.java:1237)
	at org.apache.commons.httpclient.HttpMethodBase.processRedirectResponse(HttpMethodBase.java:1185)
	at org.apache.commons.httpclient.HttpMethodBase.isRetryNeeded(HttpMethodBase.java:967)
	at org.apache.commons.httpclient.HttpMethodBase.execute(HttpMethodBase.java:1089)
	at org.apache.commons.httpclient.HttpClient.executeMethod(HttpClient.java:643)
	at org.apache.commons.httpclient.HttpClient.executeMethod(HttpClient.java:497)
	at org.apache.maven.wagon.providers.http.HttpWagon.get(HttpWagon.java:287)
	at org.apache.maven.wagon.providers.http.HttpWagon.getIfNewer(HttpWagon.java:234)
	at org.apache.maven.verifier.DependencyVerifier.getRemoteArtifact(DependencyVerifier.java:391)
	at org.apache.maven.verifier.DependencyVerifier.getDependencies(DependencyVerifier.java:291)
	at org.apache.maven.verifier.DependencyVerifier.satisfyDependencies(DependencyVerifier.java:182)
	at org.apache.maven.verifier.DependencyVerifier.verify(DependencyVerifier.java:99)
	at org.apache.maven.project.Project.verifyDependencies(Project.java:569)
	at org.apache.maven.plugin.PluginManager.attainGoals(PluginManager.java:663)
	at org.apache.maven.MavenSession.attainGoals(MavenSession.java:263)
	at org.apache.maven.jelly.tags.maven.ReactorTag.doTag(ReactorTag.java:368)
	at org.apache.commons.jelly.impl.TagScript.run(TagScript.java:247)
	at org.apache.commons.jelly.impl.ScriptBlock.run(ScriptBlock.java:95)
	at org.apache.maven.jelly.tags.werkz.MavenGoalTag.runBodyTag(MavenGoalTag.java:78)
	at org.apache.maven.jelly.tags.werkz.MavenGoalTag$MavenGoalAction.performAction(MavenGoalTag.java:109)
	at org.apache.maven.werkz.Goal.fire(Goal.java:656)
	at org.apache.maven.werkz.Goal.attain(Goal.java:592)
	at org.apache.maven.plugin.PluginManager.attainGoals(PluginManager.java:693)
	at org.apache.maven.MavenSession.attainGoals(MavenSession.java:263)
	at org.apache.maven.cli.App.doMain(App.java:511)
	at org.apache.maven.cli.App.main(App.java:1258)
	at sun.reflect.NativeMethodAccessorImpl.invoke0(Native Method)
	at sun.reflect.NativeMethodAccessorImpl.invoke(NativeMethodAccessorImpl.java:39)
	at sun.reflect.DelegatingMethodAccessorImpl.invoke(DelegatingMethodAccessorImpl.java:25)
	at java.lang.reflect.Method.invoke(Method.java:324)
	at com.werken.forehead.Forehead.run(Forehead.java:551)
	at com.werken.forehead.Forehead.main(Forehead.java:581)
Invalid Redirect URI from: http://codehaus.org:80/~jgenender/maven2//geronimo/jars/geronimo-security-builder-1.0-SNAPSHOT.jar to: http://www.codehaus.org/~jgenender/maven2//geronimo/jars/geronimo-security-builder-1.0-SNAPSHOT.jar
Error retrieving artifact from [http://codehaus.org/~jgenender/maven2]: org.apache.maven.wagon.TransferFailedException: Failed to trasfer file: http://codehaus.org/~jgenender/maven2//geronimo/jars/geronimo-security-builder-1.0-SNAPSHOT.jar. Return code is: 302
build:start:

multiproject:install-callback:
    [echo] Running jar:install for Geronimo :: J2EE
java:prepare-filesystem:

java:compile:
<depend closure="false" srcdir="1.4" dump="false" destdir="/home/continuum/build/work/1/modules/j2ee-builder/target/classes"></depend>    [echo] Compiling to /home/continuum/build/work/1/modules/j2ee-builder/target/classes
    [javac] Compiling 1 source file to /home/continuum/build/work/1/modules/j2ee-builder/target/classes

java:jar-resources:

test:prepare-filesystem:

test:test-resources:

test:compile:
setupEar:

setupEar:

setupUnpackedEar:
setupBaseUnpackedEar:

setupBaseUnpackedEar:

setupBaseUnpackedEar:



test:test:
Running post goal: test:test

jar:jar:
    [jar] Building jar: /home/continuum/build/work/1/modules/j2ee-builder/target/geronimo-j2ee-builder-1.0-SNAPSHOT.jar

jar:install:
    [echo] Installing...
Uploading to geronimo/jars/geronimo-j2ee-builder-1.0-SNAPSHOT.jar: 
.................... (95K)
Uploading to geronimo/poms/geronimo-j2ee-builder-1.0-SNAPSHOT.pom: 
.................... (12K)

+----------------------------------------
| geronimo and geronimo-plugins Geronimo :: Naming :: Builder
| Memory: 15M/18M
+----------------------------------------
DEPRECATED: the default goal should be specified in the <build> section of project.xml instead of maven.xml
DEPRECATED: the default goal should be specified in the <build> section of project.xml instead of maven.xml

build:end:

Attempting to download geronimo-j2ee-builder-1.0-SNAPSHOT.jar.
Error getting URI host
org.apache.commons.httpclient.HttpException: Redirect from host codehaus.org to www.codehaus.org is not supported
	at org.apache.commons.httpclient.HttpMethodBase.checkValidRedirect(HttpMethodBase.java:1237)
	at org.apache.commons.httpclient.HttpMethodBase.processRedirectResponse(HttpMethodBase.java:1185)
	at org.apache.commons.httpclient.HttpMethodBase.isRetryNeeded(HttpMethodBase.java:967)
	at org.apache.commons.httpclient.HttpMethodBase.execute(HttpMethodBase.java:1089)
	at org.apache.commons.httpclient.HttpClient.executeMethod(HttpClient.java:643)
	at org.apache.commons.httpclient.HttpClient.executeMethod(HttpClient.java:497)
	at org.apache.maven.wagon.providers.http.HttpWagon.get(HttpWagon.java:287)
	at org.apache.maven.wagon.providers.http.HttpWagon.getIfNewer(HttpWagon.java:234)
	at org.apache.maven.verifier.DependencyVerifier.getRemoteArtifact(DependencyVerifier.java:391)
	at org.apache.maven.verifier.DependencyVerifier.getDependencies(DependencyVerifier.java:291)
	at org.apache.maven.verifier.DependencyVerifier.satisfyDependencies(DependencyVerifier.java:182)
	at org.apache.maven.verifier.DependencyVerifier.verify(DependencyVerifier.java:99)
	at org.apache.maven.project.Project.verifyDependencies(Project.java:569)
	at org.apache.maven.plugin.PluginManager.attainGoals(PluginManager.java:663)
	at org.apache.maven.MavenSession.attainGoals(MavenSession.java:263)
	at org.apache.maven.jelly.tags.maven.ReactorTag.doTag(ReactorTag.java:368)
	at org.apache.commons.jelly.impl.TagScript.run(TagScript.java:247)
	at org.apache.commons.jelly.impl.ScriptBlock.run(ScriptBlock.java:95)
	at org.apache.maven.jelly.tags.werkz.MavenGoalTag.runBodyTag(MavenGoalTag.java:78)
	at org.apache.maven.jelly.tags.werkz.MavenGoalTag$MavenGoalAction.performAction(MavenGoalTag.java:109)
	at org.apache.maven.werkz.Goal.fire(Goal.java:656)
	at org.apache.maven.werkz.Goal.attain(Goal.java:592)
	at org.apache.maven.plugin.PluginManager.attainGoals(PluginManager.java:693)
	at org.apache.maven.MavenSession.attainGoals(MavenSession.java:263)
	at org.apache.maven.cli.App.doMain(App.java:511)
	at org.apache.maven.cli.App.main(App.java:1258)
	at sun.reflect.NativeMethodAccessorImpl.invoke0(Native Method)
	at sun.reflect.NativeMethodAccessorImpl.invoke(NativeMethodAccessorImpl.java:39)
	at sun.reflect.DelegatingMethodAccessorImpl.invoke(DelegatingMethodAccessorImpl.java:25)
	at java.lang.reflect.Method.invoke(Method.java:324)
	at com.werken.forehead.Forehead.run(Forehead.java:551)
	at com.werken.forehead.Forehead.main(Forehead.java:581)
Invalid Redirect URI from: http://codehaus.org:80/~jgenender/maven2//geronimo/jars/geronimo-j2ee-builder-1.0-SNAPSHOT.jar to: http://www.codehaus.org/~jgenender/maven2//geronimo/jars/geronimo-j2ee-builder-1.0-SNAPSHOT.jar
Error retrieving artifact from [http://codehaus.org/~jgenender/maven2]: org.apache.maven.wagon.TransferFailedException: Failed to trasfer file: http://codehaus.org/~jgenender/maven2//geronimo/jars/geronimo-j2ee-builder-1.0-SNAPSHOT.jar. Return code is: 302
build:start:

multiproject:install-callback:
    [echo] Running jar:install for Geronimo :: Naming :: Builder
java:prepare-filesystem:

java:compile:
<depend closure="false" srcdir="1.4" dump="false" destdir="/home/continuum/build/work/1/modules/naming-builder/target/classes"></depend>    [echo] Compiling to /home/continuum/build/work/1/modules/naming-builder/target/classes

java:jar-resources:

test:prepare-filesystem:

test:test-resources:

test:compile:

test:test:
    [echo] NOTICE: Skipping tests; they seem to have passed already
    [echo] No tests to run.
Running post goal: test:test

jar:jar:

jar:install:
    [echo] Installing...
Uploading to geronimo/jars/geronimo-naming-builder-1.0-SNAPSHOT.jar: 
.................... (174K)
Uploading to geronimo/poms/geronimo-naming-builder-1.0-SNAPSHOT.pom: 
.................... (12K)

+----------------------------------------
| geronimo and geronimo-plugins Geronimo :: Connector :: Builder
| Memory: 16M/18M
+----------------------------------------
DEPRECATED: the default goal should be specified in the <build> section of project.xml instead of maven.xml
DEPRECATED: the default goal should be specified in the <build> section of project.xml instead of maven.xml

build:end:

Attempting to download geronimo-test-ddbean-1.0-SNAPSHOT.jar.
Error getting URI host
org.apache.commons.httpclient.HttpException: Redirect from host codehaus.org to www.codehaus.org is not supported
	at org.apache.commons.httpclient.HttpMethodBase.checkValidRedirect(HttpMethodBase.java:1237)
	at org.apache.commons.httpclient.HttpMethodBase.processRedirectResponse(HttpMethodBase.java:1185)
	at org.apache.commons.httpclient.HttpMethodBase.isRetryNeeded(HttpMethodBase.java:967)
	at org.apache.commons.httpclient.HttpMethodBase.execute(HttpMethodBase.java:1089)
	at org.apache.commons.httpclient.HttpClient.executeMethod(HttpClient.java:643)
	at org.apache.commons.httpclient.HttpClient.executeMethod(HttpClient.java:497)
	at org.apache.maven.wagon.providers.http.HttpWagon.get(HttpWagon.java:287)
	at org.apache.maven.wagon.providers.http.HttpWagon.getIfNewer(HttpWagon.java:234)
	at org.apache.maven.verifier.DependencyVerifier.getRemoteArtifact(DependencyVerifier.java:391)
	at org.apache.maven.verifier.DependencyVerifier.getDependencies(DependencyVerifier.java:291)
	at org.apache.maven.verifier.DependencyVerifier.satisfyDependencies(DependencyVerifier.java:182)
	at org.apache.maven.verifier.DependencyVerifier.verify(DependencyVerifier.java:99)
	at org.apache.maven.project.Project.verifyDependencies(Project.java:569)
	at org.apache.maven.plugin.PluginManager.attainGoals(PluginManager.java:663)
	at org.apache.maven.MavenSession.attainGoals(MavenSession.java:263)
	at org.apache.maven.jelly.tags.maven.ReactorTag.doTag(ReactorTag.java:368)
	at org.apache.commons.jelly.impl.TagScript.run(TagScript.java:247)
	at org.apache.commons.jelly.impl.ScriptBlock.run(ScriptBlock.java:95)
	at org.apache.maven.jelly.tags.werkz.MavenGoalTag.runBodyTag(MavenGoalTag.java:78)
	at org.apache.maven.jelly.tags.werkz.MavenGoalTag$MavenGoalAction.performAction(MavenGoalTag.java:109)
	at org.apache.maven.werkz.Goal.fire(Goal.java:656)
	at org.apache.maven.werkz.Goal.attain(Goal.java:592)
	at org.apache.maven.plugin.PluginManager.attainGoals(PluginManager.java:693)
	at org.apache.maven.MavenSession.attainGoals(MavenSession.java:263)
	at org.apache.maven.cli.App.doMain(App.java:511)
	at org.apache.maven.cli.App.main(App.java:1258)
	at sun.reflect.NativeMethodAccessorImpl.invoke0(Native Method)
	at sun.reflect.NativeMethodAccessorImpl.invoke(NativeMethodAccessorImpl.java:39)
	at sun.reflect.DelegatingMethodAccessorImpl.invoke(DelegatingMethodAccessorImpl.java:25)
	at java.lang.reflect.Method.invoke(Method.java:324)
	at com.werken.forehead.Forehead.run(Forehead.java:551)
	at com.werken.forehead.Forehead.main(Forehead.java:581)
Invalid Redirect URI from: http://codehaus.org:80/~jgenender/maven2//geronimo/jars/geronimo-test-ddbean-1.0-SNAPSHOT.jar to: http://www.codehaus.org/~jgenender/maven2//geronimo/jars/geronimo-test-ddbean-1.0-SNAPSHOT.jar
Error retrieving artifact from [http://codehaus.org/~jgenender/maven2]: org.apache.maven.wagon.TransferFailedException: Failed to trasfer file: http://codehaus.org/~jgenender/maven2//geronimo/jars/geronimo-test-ddbean-1.0-SNAPSHOT.jar. Return code is: 302
Attempting to download geronimo-connector-1.0-SNAPSHOT.jar.
Error getting URI host
org.apache.commons.httpclient.HttpException: Redirect from host codehaus.org to www.codehaus.org is not supported
	at org.apache.commons.httpclient.HttpMethodBase.checkValidRedirect(HttpMethodBase.java:1237)
	at org.apache.commons.httpclient.HttpMethodBase.processRedirectResponse(HttpMethodBase.java:1185)
	at org.apache.commons.httpclient.HttpMethodBase.isRetryNeeded(HttpMethodBase.java:967)
	at org.apache.commons.httpclient.HttpMethodBase.execute(HttpMethodBase.java:1089)
	at org.apache.commons.httpclient.HttpClient.executeMethod(HttpClient.java:643)
	at org.apache.commons.httpclient.HttpClient.executeMethod(HttpClient.java:497)
	at org.apache.maven.wagon.providers.http.HttpWagon.get(HttpWagon.java:287)
	at org.apache.maven.wagon.providers.http.HttpWagon.getIfNewer(HttpWagon.java:234)
	at org.apache.maven.verifier.DependencyVerifier.getRemoteArtifact(DependencyVerifier.java:391)
	at org.apache.maven.verifier.DependencyVerifier.getDependencies(DependencyVerifier.java:291)
	at org.apache.maven.verifier.DependencyVerifier.satisfyDependencies(DependencyVerifier.java:182)
	at org.apache.maven.verifier.DependencyVerifier.verify(DependencyVerifier.java:99)
	at org.apache.maven.project.Project.verifyDependencies(Project.java:569)
	at org.apache.maven.plugin.PluginManager.attainGoals(PluginManager.java:663)
	at org.apache.maven.MavenSession.attainGoals(MavenSession.java:263)
	at org.apache.maven.jelly.tags.maven.ReactorTag.doTag(ReactorTag.java:368)
	at org.apache.commons.jelly.impl.TagScript.run(TagScript.java:247)
	at org.apache.commons.jelly.impl.ScriptBlock.run(ScriptBlock.java:95)
	at org.apache.maven.jelly.tags.werkz.MavenGoalTag.runBodyTag(MavenGoalTag.java:78)
	at org.apache.maven.jelly.tags.werkz.MavenGoalTag$MavenGoalAction.performAction(MavenGoalTag.java:109)
	at org.apache.maven.werkz.Goal.fire(Goal.java:656)
	at org.apache.maven.werkz.Goal.attain(Goal.java:592)
	at org.apache.maven.plugin.PluginManager.attainGoals(PluginManager.java:693)
	at org.apache.maven.MavenSession.attainGoals(MavenSession.java:263)
	at org.apache.maven.cli.App.doMain(App.java:511)
	at org.apache.maven.cli.App.main(App.java:1258)
	at sun.reflect.NativeMethodAccessorImpl.invoke0(Native Method)
	at sun.reflect.NativeMethodAccessorImpl.invoke(NativeMethodAccessorImpl.java:39)
	at sun.reflect.DelegatingMethodAccessorImpl.invoke(DelegatingMethodAccessorImpl.java:25)
	at java.lang.reflect.Method.invoke(Method.java:324)
	at com.werken.forehead.Forehead.run(Forehead.java:551)
	at com.werken.forehead.Forehead.main(Forehead.java:581)
Invalid Redirect URI from: http://codehaus.org:80/~jgenender/maven2//geronimo/jars/geronimo-connector-1.0-SNAPSHOT.jar to: http://www.codehaus.org/~jgenender/maven2//geronimo/jars/geronimo-connector-1.0-SNAPSHOT.jar
Error retrieving artifact from [http://codehaus.org/~jgenender/maven2]: org.apache.maven.wagon.TransferFailedException: Failed to trasfer file: http://codehaus.org/~jgenender/maven2//geronimo/jars/geronimo-connector-1.0-SNAPSHOT.jar. Return code is: 302
Attempting to download geronimo-naming-builder-1.0-SNAPSHOT.jar.
Error getting URI host
org.apache.commons.httpclient.HttpException: Redirect from host codehaus.org to www.codehaus.org is not supported
	at org.apache.commons.httpclient.HttpMethodBase.checkValidRedirect(HttpMethodBase.java:1237)
	at org.apache.commons.httpclient.HttpMethodBase.processRedirectResponse(HttpMethodBase.java:1185)
	at org.apache.commons.httpclient.HttpMethodBase.isRetryNeeded(HttpMethodBase.java:967)
	at org.apache.commons.httpclient.HttpMethodBase.execute(HttpMethodBase.java:1089)
	at org.apache.commons.httpclient.HttpClient.executeMethod(HttpClient.java:643)
	at org.apache.commons.httpclient.HttpClient.executeMethod(HttpClient.java:497)
	at org.apache.maven.wagon.providers.http.HttpWagon.get(HttpWagon.java:287)
	at org.apache.maven.wagon.providers.http.HttpWagon.getIfNewer(HttpWagon.java:234)
	at org.apache.maven.verifier.DependencyVerifier.getRemoteArtifact(DependencyVerifier.java:391)
	at org.apache.maven.verifier.DependencyVerifier.getDependencies(DependencyVerifier.java:291)
	at org.apache.maven.verifier.DependencyVerifier.satisfyDependencies(DependencyVerifier.java:182)
	at org.apache.maven.verifier.DependencyVerifier.verify(DependencyVerifier.java:99)
	at org.apache.maven.project.Project.verifyDependencies(Project.java:569)
	at org.apache.maven.plugin.PluginManager.attainGoals(PluginManager.java:663)
	at org.apache.maven.MavenSession.attainGoals(MavenSession.java:263)
	at org.apache.maven.jelly.tags.maven.ReactorTag.doTag(ReactorTag.java:368)
	at org.apache.commons.jelly.impl.TagScript.run(TagScript.java:247)
	at org.apache.commons.jelly.impl.ScriptBlock.run(ScriptBlock.java:95)
	at org.apache.maven.jelly.tags.werkz.MavenGoalTag.runBodyTag(MavenGoalTag.java:78)
	at org.apache.maven.jelly.tags.werkz.MavenGoalTag$MavenGoalAction.performAction(MavenGoalTag.java:109)
	at org.apache.maven.werkz.Goal.fire(Goal.java:656)
	at org.apache.maven.werkz.Goal.attain(Goal.java:592)
	at org.apache.maven.plugin.PluginManager.attainGoals(PluginManager.java:693)
	at org.apache.maven.MavenSession.attainGoals(MavenSession.java:263)
	at org.apache.maven.cli.App.doMain(App.java:511)
	at org.apache.maven.cli.App.main(App.java:1258)
	at sun.reflect.NativeMethodAccessorImpl.invoke0(Native Method)
	at sun.reflect.NativeMethodAccessorImpl.invoke(NativeMethodAccessorImpl.java:39)
	at sun.reflect.DelegatingMethodAccessorImpl.invoke(DelegatingMethodAccessorImpl.java:25)
	at java.lang.reflect.Method.invoke(Method.java:324)
	at com.werken.forehead.Forehead.run(Forehead.java:551)
	at com.werken.forehead.Forehead.main(Forehead.java:581)
Invalid Redirect URI from: http://codehaus.org:80/~jgenender/maven2//geronimo/jars/geronimo-naming-builder-1.0-SNAPSHOT.jar to: http://www.codehaus.org/~jgenender/maven2//geronimo/jars/geronimo-naming-builder-1.0-SNAPSHOT.jar
Error retrieving artifact from [http://codehaus.org/~jgenender/maven2]: org.apache.maven.wagon.TransferFailedException: Failed to trasfer file: http://codehaus.org/~jgenender/maven2//geronimo/jars/geronimo-naming-builder-1.0-SNAPSHOT.jar. Return code is: 302
build:start:

multiproject:install-callback:
    [echo] Running jar:install for Geronimo :: Connector :: Builder
java:prepare-filesystem:

java:compile:
<depend closure="false" srcdir="1.4" dump="false" destdir="/home/continuum/build/work/1/modules/connector-builder/target/classes"></depend>    [echo] Compiling to /home/continuum/build/work/1/modules/connector-builder/target/classes

java:jar-resources:

test:prepare-filesystem:

test:test-resources:

test:compile:

test:test:
    [echo] NOTICE: Skipping tests; they seem to have passed already
    [echo] No tests to run.
Running post goal: test:test

jar:jar:

jar:install:
    [echo] Installing...
Uploading to geronimo/jars/geronimo-connector-builder-1.0-SNAPSHOT.jar: 
.................... (205K)
Uploading to geronimo/poms/geronimo-connector-builder-1.0-SNAPSHOT.pom: 
.................... (14K)

+----------------------------------------
| geronimo and geronimo-plugins Geronimo :: Axis :: Builder
| Memory: 12M/19M
+----------------------------------------
DEPRECATED: the default goal should be specified in the <build> section of project.xml instead of maven.xml
DEPRECATED: the default goal should be specified in the <build> section of project.xml instead of maven.xml

build:end:

Attempting to download geronimo-axis-1.0-SNAPSHOT.jar.
Error getting URI host
org.apache.commons.httpclient.HttpException: Redirect from host codehaus.org to www.codehaus.org is not supported
	at org.apache.commons.httpclient.HttpMethodBase.checkValidRedirect(HttpMethodBase.java:1237)
	at org.apache.commons.httpclient.HttpMethodBase.processRedirectResponse(HttpMethodBase.java:1185)
	at org.apache.commons.httpclient.HttpMethodBase.isRetryNeeded(HttpMethodBase.java:967)
	at org.apache.commons.httpclient.HttpMethodBase.execute(HttpMethodBase.java:1089)
	at org.apache.commons.httpclient.HttpClient.executeMethod(HttpClient.java:643)
	at org.apache.commons.httpclient.HttpClient.executeMethod(HttpClient.java:497)
	at org.apache.maven.wagon.providers.http.HttpWagon.get(HttpWagon.java:287)
	at org.apache.maven.wagon.providers.http.HttpWagon.getIfNewer(HttpWagon.java:234)
	at org.apache.maven.verifier.DependencyVerifier.getRemoteArtifact(DependencyVerifier.java:391)
	at org.apache.maven.verifier.DependencyVerifier.getDependencies(DependencyVerifier.java:291)
	at org.apache.maven.verifier.DependencyVerifier.satisfyDependencies(DependencyVerifier.java:182)
	at org.apache.maven.verifier.DependencyVerifier.verify(DependencyVerifier.java:99)
	at org.apache.maven.project.Project.verifyDependencies(Project.java:569)
	at org.apache.maven.plugin.PluginManager.attainGoals(PluginManager.java:663)
	at org.apache.maven.MavenSession.attainGoals(MavenSession.java:263)
	at org.apache.maven.jelly.tags.maven.ReactorTag.doTag(ReactorTag.java:368)
	at org.apache.commons.jelly.impl.TagScript.run(TagScript.java:247)
	at org.apache.commons.jelly.impl.ScriptBlock.run(ScriptBlock.java:95)
	at org.apache.maven.jelly.tags.werkz.MavenGoalTag.runBodyTag(MavenGoalTag.java:78)
	at org.apache.maven.jelly.tags.werkz.MavenGoalTag$MavenGoalAction.performAction(MavenGoalTag.java:109)
	at org.apache.maven.werkz.Goal.fire(Goal.java:656)
	at org.apache.maven.werkz.Goal.attain(Goal.java:592)
	at org.apache.maven.plugin.PluginManager.attainGoals(PluginManager.java:693)
	at org.apache.maven.MavenSession.attainGoals(MavenSession.java:263)
	at org.apache.maven.cli.App.doMain(App.java:511)
	at org.apache.maven.cli.App.main(App.java:1258)
	at sun.reflect.NativeMethodAccessorImpl.invoke0(Native Method)
	at sun.reflect.NativeMethodAccessorImpl.invoke(NativeMethodAccessorImpl.java:39)
	at sun.reflect.DelegatingMethodAccessorImpl.invoke(DelegatingMethodAccessorImpl.java:25)
	at java.lang.reflect.Method.invoke(Method.java:324)
	at com.werken.forehead.Forehead.run(Forehead.java:551)
	at com.werken.forehead.Forehead.main(Forehead.java:581)
Invalid Redirect URI from: http://codehaus.org:80/~jgenender/maven2//geronimo/jars/geronimo-axis-1.0-SNAPSHOT.jar to: http://www.codehaus.org/~jgenender/maven2//geronimo/jars/geronimo-axis-1.0-SNAPSHOT.jar
Error retrieving artifact from [http://codehaus.org/~jgenender/maven2]: org.apache.maven.wagon.TransferFailedException: Failed to trasfer file: http://codehaus.org/~jgenender/maven2//geronimo/jars/geronimo-axis-1.0-SNAPSHOT.jar. Return code is: 302
Attempting to download geronimo-connector-builder-1.0-SNAPSHOT.jar.
Error getting URI host
org.apache.commons.httpclient.HttpException: Redirect from host codehaus.org to www.codehaus.org is not supported
	at org.apache.commons.httpclient.HttpMethodBase.checkValidRedirect(HttpMethodBase.java:1237)
	at org.apache.commons.httpclient.HttpMethodBase.processRedirectResponse(HttpMethodBase.java:1185)
	at org.apache.commons.httpclient.HttpMethodBase.isRetryNeeded(HttpMethodBase.java:967)
	at org.apache.commons.httpclient.HttpMethodBase.execute(HttpMethodBase.java:1089)
	at org.apache.commons.httpclient.HttpClient.executeMethod(HttpClient.java:643)
	at org.apache.commons.httpclient.HttpClient.executeMethod(HttpClient.java:497)
	at org.apache.maven.wagon.providers.http.HttpWagon.get(HttpWagon.java:287)
	at org.apache.maven.wagon.providers.http.HttpWagon.getIfNewer(HttpWagon.java:234)
	at org.apache.maven.verifier.DependencyVerifier.getRemoteArtifact(DependencyVerifier.java:391)
	at org.apache.maven.verifier.DependencyVerifier.getDependencies(DependencyVerifier.java:291)
	at org.apache.maven.verifier.DependencyVerifier.satisfyDependencies(DependencyVerifier.java:182)
	at org.apache.maven.verifier.DependencyVerifier.verify(DependencyVerifier.java:99)
	at org.apache.maven.project.Project.verifyDependencies(Project.java:569)
	at org.apache.maven.plugin.PluginManager.attainGoals(PluginManager.java:663)
	at org.apache.maven.MavenSession.attainGoals(MavenSession.java:263)
	at org.apache.maven.jelly.tags.maven.ReactorTag.doTag(ReactorTag.java:368)
	at org.apache.commons.jelly.impl.TagScript.run(TagScript.java:247)
	at org.apache.commons.jelly.impl.ScriptBlock.run(ScriptBlock.java:95)
	at org.apache.maven.jelly.tags.werkz.MavenGoalTag.runBodyTag(MavenGoalTag.java:78)
	at org.apache.maven.jelly.tags.werkz.MavenGoalTag$MavenGoalAction.performAction(MavenGoalTag.java:109)
	at org.apache.maven.werkz.Goal.fire(Goal.java:656)
	at org.apache.maven.werkz.Goal.attain(Goal.java:592)
	at org.apache.maven.plugin.PluginManager.attainGoals(PluginManager.java:693)
	at org.apache.maven.MavenSession.attainGoals(MavenSession.java:263)
	at org.apache.maven.cli.App.doMain(App.java:511)
	at org.apache.maven.cli.App.main(App.java:1258)
	at sun.reflect.NativeMethodAccessorImpl.invoke0(Native Method)
	at sun.reflect.NativeMethodAccessorImpl.invoke(NativeMethodAccessorImpl.java:39)
	at sun.reflect.DelegatingMethodAccessorImpl.invoke(DelegatingMethodAccessorImpl.java:25)
	at java.lang.reflect.Method.invoke(Method.java:324)
	at com.werken.forehead.Forehead.run(Forehead.java:551)
	at com.werken.forehead.Forehead.main(Forehead.java:581)
Invalid Redirect URI from: http://codehaus.org:80/~jgenender/maven2//geronimo/jars/geronimo-connector-builder-1.0-SNAPSHOT.jar to: http://www.codehaus.org/~jgenender/maven2//geronimo/jars/geronimo-connector-builder-1.0-SNAPSHOT.jar
Error retrieving artifact from [http://codehaus.org/~jgenender/maven2]: org.apache.maven.wagon.TransferFailedException: Failed to trasfer file: http://codehaus.org/~jgenender/maven2//geronimo/jars/geronimo-connector-builder-1.0-SNAPSHOT.jar. Return code is: 302
build:start:

multiproject:install-callback:
    [echo] Running jar:install for Geronimo :: Axis :: Builder
java:prepare-filesystem:

java:compile:
<depend closure="false" srcdir="1.4" dump="false" destdir="/home/continuum/build/work/1/modules/axis-builder/target/classes"></depend>    [echo] Compiling to /home/continuum/build/work/1/modules/axis-builder/target/classes

java:jar-resources:

test:prepare-filesystem:

test:test-resources:

test:compile:

test:test:
    [echo] NOTICE: Skipping tests; they seem to have passed already
    [echo] No tests to run.
Running post goal: test:test

jar:jar:

jar:install:
    [echo] Installing...
Uploading to geronimo/jars/geronimo-axis-builder-1.0-SNAPSHOT.jar: 
.................... (243K)
Uploading to geronimo/poms/geronimo-axis-builder-1.0-SNAPSHOT.pom: 
.................... (14K)

+----------------------------------------
| geronimo and geronimo-plugins Geronimo :: Client
| Memory: 13M/19M
+----------------------------------------
DEPRECATED: the default goal should be specified in the <build> section of project.xml instead of maven.xml

build:end:

build:start:

multiproject:install-callback:
    [echo] Running jar:install for Geronimo :: Client
java:prepare-filesystem:

java:compile:
<depend closure="false" srcdir="1.4" dump="false" destdir="/home/continuum/build/work/1/modules/client/target/classes"></depend>    [echo] Compiling to /home/continuum/build/work/1/modules/client/target/classes

java:jar-resources:

test:prepare-filesystem:

test:test-resources:

test:compile:
    [echo] No test source files to compile.

test:test:
    [echo] NOTICE: Skipping tests; they seem to have passed already
    [echo] No tests to run.
Running post goal: test:test

jar:jar:

jar:install:
    [echo] Installing...
Uploading to geronimo/jars/geronimo-client-1.0-SNAPSHOT.jar: 
.................... (14K)
Uploading to geronimo/poms/geronimo-client-1.0-SNAPSHOT.pom: 
.................... (11K)

+----------------------------------------
| geronimo and geronimo-plugins Geronimo :: Client Builder
| Memory: 15M/19M
+----------------------------------------
DEPRECATED: the default goal should be specified in the <build> section of project.xml instead of maven.xml
DEPRECATED: the default goal should be specified in the <build> section of project.xml instead of maven.xml

build:end:

Attempting to download geronimo-client-1.0-SNAPSHOT.jar.
Error getting URI host
org.apache.commons.httpclient.HttpException: Redirect from host codehaus.org to www.codehaus.org is not supported
	at org.apache.commons.httpclient.HttpMethodBase.checkValidRedirect(HttpMethodBase.java:1237)
	at org.apache.commons.httpclient.HttpMethodBase.processRedirectResponse(HttpMethodBase.java:1185)
	at org.apache.commons.httpclient.HttpMethodBase.isRetryNeeded(HttpMethodBase.java:967)
	at org.apache.commons.httpclient.HttpMethodBase.execute(HttpMethodBase.java:1089)
	at org.apache.commons.httpclient.HttpClient.executeMethod(HttpClient.java:643)
	at org.apache.commons.httpclient.HttpClient.executeMethod(HttpClient.java:497)
	at org.apache.maven.wagon.providers.http.HttpWagon.get(HttpWagon.java:287)
	at org.apache.maven.wagon.providers.http.HttpWagon.getIfNewer(HttpWagon.java:234)
	at org.apache.maven.verifier.DependencyVerifier.getRemoteArtifact(DependencyVerifier.java:391)
	at org.apache.maven.verifier.DependencyVerifier.getDependencies(DependencyVerifier.java:291)
	at org.apache.maven.verifier.DependencyVerifier.satisfyDependencies(DependencyVerifier.java:182)
	at org.apache.maven.verifier.DependencyVerifier.verify(DependencyVerifier.java:99)
	at org.apache.maven.project.Project.verifyDependencies(Project.java:569)
	at org.apache.maven.plugin.PluginManager.attainGoals(PluginManager.java:663)
	at org.apache.maven.MavenSession.attainGoals(MavenSession.java:263)
	at org.apache.maven.jelly.tags.maven.ReactorTag.doTag(ReactorTag.java:368)
	at org.apache.commons.jelly.impl.TagScript.run(TagScript.java:247)
	at org.apache.commons.jelly.impl.ScriptBlock.run(ScriptBlock.java:95)
	at org.apache.maven.jelly.tags.werkz.MavenGoalTag.runBodyTag(MavenGoalTag.java:78)
	at org.apache.maven.jelly.tags.werkz.MavenGoalTag$MavenGoalAction.performAction(MavenGoalTag.java:109)
	at org.apache.maven.werkz.Goal.fire(Goal.java:656)
	at org.apache.maven.werkz.Goal.attain(Goal.java:592)
	at org.apache.maven.plugin.PluginManager.attainGoals(PluginManager.java:693)
	at org.apache.maven.MavenSession.attainGoals(MavenSession.java:263)
	at org.apache.maven.cli.App.doMain(App.java:511)
	at org.apache.maven.cli.App.main(App.java:1258)
	at sun.reflect.NativeMethodAccessorImpl.invoke0(Native Method)
	at sun.reflect.NativeMethodAccessorImpl.invoke(NativeMethodAccessorImpl.java:39)
	at sun.reflect.DelegatingMethodAccessorImpl.invoke(DelegatingMethodAccessorImpl.java:25)
	at java.lang.reflect.Method.invoke(Method.java:324)
	at com.werken.forehead.Forehead.run(Forehead.java:551)
	at com.werken.forehead.Forehead.main(Forehead.java:581)
Invalid Redirect URI from: http://codehaus.org:80/~jgenender/maven2//geronimo/jars/geronimo-client-1.0-SNAPSHOT.jar to: http://www.codehaus.org/~jgenender/maven2//geronimo/jars/geronimo-client-1.0-SNAPSHOT.jar
Error retrieving artifact from [http://codehaus.org/~jgenender/maven2]: org.apache.maven.wagon.TransferFailedException: Failed to trasfer file: http://codehaus.org/~jgenender/maven2//geronimo/jars/geronimo-client-1.0-SNAPSHOT.jar. Return code is: 302
build:start:

multiproject:install-callback:
    [echo] Running jar:install for Geronimo :: Client Builder
java:prepare-filesystem:

java:compile:
<depend closure="false" srcdir="1.4" dump="false" destdir="/home/continuum/build/work/1/modules/client-builder/target/classes"></depend>    [echo] Compiling to /home/continuum/build/work/1/modules/client-builder/target/classes

java:jar-resources:

test:prepare-filesystem:

test:test-resources:

test:compile:

test:test:
    [echo] NOTICE: Skipping tests; they seem to have passed already
    [echo] No tests to run.
Running post goal: test:test

jar:jar:

jar:install:
    [echo] Installing...
Uploading to geronimo/jars/geronimo-client-builder-1.0-SNAPSHOT.jar: 
.................... (56K)
Uploading to geronimo/poms/geronimo-client-builder-1.0-SNAPSHOT.pom: 
.................... (13K)

+----------------------------------------
| geronimo and geronimo-plugins Geronimo :: Console Web
| Memory: 17M/19M
+----------------------------------------
DEPRECATED: the default goal should be specified in the <build> section of project.xml instead of maven.xml
DEPRECATED: the default goal should be specified in the <build> section of project.xml instead of maven.xml

build:end:

build:start:

multiproject:install-callback:
    [echo] Running jar:install for Geronimo :: Console Web
java:prepare-filesystem:

java:compile:
<depend closure="false" srcdir="1.4" dump="false" destdir="/home/continuum/build/work/1/modules/console-web/target/classes"></depend>    [echo] Compiling to /home/continuum/build/work/1/modules/console-web/target/classes

java:jar-resources:

test:prepare-filesystem:

test:test-resources:

test:compile:
    [echo] No test source files to compile.

test:test:
    [echo] NOTICE: Skipping tests; they seem to have passed already
    [echo] No tests to run.
Running post goal: test:test

jar:jar:

jar:install:
    [echo] Installing...
Uploading to geronimo/jars/geronimo-console-web-1.0-SNAPSHOT.jar: 
.................... (17K)
Uploading to geronimo/poms/geronimo-console-web-1.0-SNAPSHOT.pom: 
.................... (10K)

+----------------------------------------
| geronimo and geronimo-plugins Geronimo :: Configuration Converter
| Memory: 17M/19M
+----------------------------------------
DEPRECATED: the default goal should be specified in the <build> section of project.xml instead of maven.xml
DEPRECATED: the default goal should be specified in the <build> section of project.xml instead of maven.xml

build:end:

build:start:

multiproject:install-callback:
    [echo] Running jar:install for Geronimo :: Configuration Converter
java:prepare-filesystem:

java:compile:
<depend closure="false" srcdir="1.4" dump="false" destdir="/home/continuum/build/work/1/modules/converter/target/classes"></depend>    [echo] Compiling to /home/continuum/build/work/1/modules/converter/target/classes

java:jar-resources:

test:prepare-filesystem:

test:test-resources:

test:compile:
    [echo] No test source files to compile.

test:test:
    [echo] NOTICE: Skipping tests; they seem to have passed already
    [echo] No tests to run.
Running post goal: test:test

jar:jar:

jar:install:
    [echo] Installing...
Uploading to geronimo/jars/geronimo-converter-1.0-SNAPSHOT.jar: 
.................... (25K)
Uploading to geronimo/poms/geronimo-converter-1.0-SNAPSHOT.pom: 
.................... (10K)

+----------------------------------------
| geronimo and geronimo-plugins Geronimo :: Web :: Builder
| Memory: 18M/19M
+----------------------------------------
DEPRECATED: the default goal should be specified in the <build> section of project.xml instead of maven.xml
DEPRECATED: the default goal should be specified in the <build> section of project.xml instead of maven.xml

build:end:

build:start:

multiproject:install-callback:
    [echo] Running jar:install for Geronimo :: Web :: Builder
java:prepare-filesystem:

java:compile:
<depend closure="false" srcdir="1.4" dump="false" destdir="/home/continuum/build/work/1/modules/web-builder/target/classes"></depend>    [echo] Compiling to /home/continuum/build/work/1/modules/web-builder/target/classes

java:jar-resources:

test:prepare-filesystem:

test:test-resources:

test:compile:

test:test:
    [echo] NOTICE: Skipping tests; they seem to have passed already
    [echo] No tests to run.
Running post goal: test:test

jar:jar:

jar:install:
    [echo] Installing...
Uploading to geronimo/jars/geronimo-web-builder-1.0-SNAPSHOT.jar: 
.................... (41K)
Uploading to geronimo/poms/geronimo-web-builder-1.0-SNAPSHOT.pom: 
.................... (12K)

+----------------------------------------
| geronimo and geronimo-plugins Geronimo :: Deploy :: JSR-88
| Memory: 10M/19M
+----------------------------------------
DEPRECATED: the default goal should be specified in the <build> section of project.xml instead of maven.xml
DEPRECATED: the default goal should be specified in the <build> section of project.xml instead of maven.xml

build:end:

Attempting to download geronimo-web-builder-1.0-SNAPSHOT.jar.
Error getting URI host
org.apache.commons.httpclient.HttpException: Redirect from host codehaus.org to www.codehaus.org is not supported
	at org.apache.commons.httpclient.HttpMethodBase.checkValidRedirect(HttpMethodBase.java:1237)
	at org.apache.commons.httpclient.HttpMethodBase.processRedirectResponse(HttpMethodBase.java:1185)
	at org.apache.commons.httpclient.HttpMethodBase.isRetryNeeded(HttpMethodBase.java:967)
	at org.apache.commons.httpclient.HttpMethodBase.execute(HttpMethodBase.java:1089)
	at org.apache.commons.httpclient.HttpClient.executeMethod(HttpClient.java:643)
	at org.apache.commons.httpclient.HttpClient.executeMethod(HttpClient.java:497)
	at org.apache.maven.wagon.providers.http.HttpWagon.get(HttpWagon.java:287)
	at org.apache.maven.wagon.providers.http.HttpWagon.getIfNewer(HttpWagon.java:234)
	at org.apache.maven.verifier.DependencyVerifier.getRemoteArtifact(DependencyVerifier.java:391)
	at org.apache.maven.verifier.DependencyVerifier.getDependencies(DependencyVerifier.java:291)
	at org.apache.maven.verifier.DependencyVerifier.satisfyDependencies(DependencyVerifier.java:182)
	at org.apache.maven.verifier.DependencyVerifier.verify(DependencyVerifier.java:99)
	at org.apache.maven.project.Project.verifyDependencies(Project.java:569)
	at org.apache.maven.plugin.PluginManager.attainGoals(PluginManager.java:663)
	at org.apache.maven.MavenSession.attainGoals(MavenSession.java:263)
	at org.apache.maven.jelly.tags.maven.ReactorTag.doTag(ReactorTag.java:368)
	at org.apache.commons.jelly.impl.TagScript.run(TagScript.java:247)
	at org.apache.commons.jelly.impl.ScriptBlock.run(ScriptBlock.java:95)
	at org.apache.maven.jelly.tags.werkz.MavenGoalTag.runBodyTag(MavenGoalTag.java:78)
	at org.apache.maven.jelly.tags.werkz.MavenGoalTag$MavenGoalAction.performAction(MavenGoalTag.java:109)
	at org.apache.maven.werkz.Goal.fire(Goal.java:656)
	at org.apache.maven.werkz.Goal.attain(Goal.java:592)
	at org.apache.maven.plugin.PluginManager.attainGoals(PluginManager.java:693)
	at org.apache.maven.MavenSession.attainGoals(MavenSession.java:263)
	at org.apache.maven.cli.App.doMain(App.java:511)
	at org.apache.maven.cli.App.main(App.java:1258)
	at sun.reflect.NativeMethodAccessorImpl.invoke0(Native Method)
	at sun.reflect.NativeMethodAccessorImpl.invoke(NativeMethodAccessorImpl.java:39)
	at sun.reflect.DelegatingMethodAccessorImpl.invoke(DelegatingMethodAccessorImpl.java:25)
	at java.lang.reflect.Method.invoke(Method.java:324)
	at com.werken.forehead.Forehead.run(Forehead.java:551)
	at com.werken.forehead.Forehead.main(Forehead.java:581)
Invalid Redirect URI from: http://codehaus.org:80/~jgenender/maven2//geronimo/jars/geronimo-web-builder-1.0-SNAPSHOT.jar to: http://www.codehaus.org/~jgenender/maven2//geronimo/jars/geronimo-web-builder-1.0-SNAPSHOT.jar
Error retrieving artifact from [http://codehaus.org/~jgenender/maven2]: org.apache.maven.wagon.TransferFailedException: Failed to trasfer file: http://codehaus.org/~jgenender/maven2//geronimo/jars/geronimo-web-builder-1.0-SNAPSHOT.jar. Return code is: 302
build:start:

multiproject:install-callback:
    [echo] Running jar:install for Geronimo :: Deploy :: JSR-88
java:prepare-filesystem:

java:compile:
<depend closure="false" srcdir="1.4" dump="false" destdir="/home/continuum/build/work/1/modules/deploy-jsr88/target/classes"></depend>    [echo] Compiling to /home/continuum/build/work/1/modules/deploy-jsr88/target/classes

java:jar-resources:

test:prepare-filesystem:

test:test-resources:

test:compile:

test:test:
    [echo] NOTICE: Skipping tests; they seem to have passed already
    [echo] No tests to run.
Running post goal: test:test

jar:jar:

jar:install:
    [echo] Installing...
Uploading to geronimo/jars/geronimo-deploy-jsr88-1.0-SNAPSHOT.jar: 
.................... (55K)
Uploading to geronimo/poms/geronimo-deploy-jsr88-1.0-SNAPSHOT.pom: 
.................... (12K)

+----------------------------------------
| geronimo and geronimo-plugins Geronimo :: Deploy :: CLI Tool
| Memory: 11M/19M
+----------------------------------------
DEPRECATED: the default goal should be specified in the <build> section of project.xml instead of maven.xml
DEPRECATED: the default goal should be specified in the <build> section of project.xml instead of maven.xml

build:end:

Attempting to download geronimo-deploy-jsr88-1.0-SNAPSHOT.jar.
Error getting URI host
org.apache.commons.httpclient.HttpException: Redirect from host codehaus.org to www.codehaus.org is not supported
	at org.apache.commons.httpclient.HttpMethodBase.checkValidRedirect(HttpMethodBase.java:1237)
	at org.apache.commons.httpclient.HttpMethodBase.processRedirectResponse(HttpMethodBase.java:1185)
	at org.apache.commons.httpclient.HttpMethodBase.isRetryNeeded(HttpMethodBase.java:967)
	at org.apache.commons.httpclient.HttpMethodBase.execute(HttpMethodBase.java:1089)
	at org.apache.commons.httpclient.HttpClient.executeMethod(HttpClient.java:643)
	at org.apache.commons.httpclient.HttpClient.executeMethod(HttpClient.java:497)
	at org.apache.maven.wagon.providers.http.HttpWagon.get(HttpWagon.java:287)
	at org.apache.maven.wagon.providers.http.HttpWagon.getIfNewer(HttpWagon.java:234)
	at org.apache.maven.verifier.DependencyVerifier.getRemoteArtifact(DependencyVerifier.java:391)
	at org.apache.maven.verifier.DependencyVerifier.getDependencies(DependencyVerifier.java:291)
	at org.apache.maven.verifier.DependencyVerifier.satisfyDependencies(DependencyVerifier.java:182)
	at org.apache.maven.verifier.DependencyVerifier.verify(DependencyVerifier.java:99)
	at org.apache.maven.project.Project.verifyDependencies(Project.java:569)
	at org.apache.maven.plugin.PluginManager.attainGoals(PluginManager.java:663)
	at org.apache.maven.MavenSession.attainGoals(MavenSession.java:263)
	at org.apache.maven.jelly.tags.maven.ReactorTag.doTag(ReactorTag.java:368)
	at org.apache.commons.jelly.impl.TagScript.run(TagScript.java:247)
	at org.apache.commons.jelly.impl.ScriptBlock.run(ScriptBlock.java:95)
	at org.apache.maven.jelly.tags.werkz.MavenGoalTag.runBodyTag(MavenGoalTag.java:78)
	at org.apache.maven.jelly.tags.werkz.MavenGoalTag$MavenGoalAction.performAction(MavenGoalTag.java:109)
	at org.apache.maven.werkz.Goal.fire(Goal.java:656)
	at org.apache.maven.werkz.Goal.attain(Goal.java:592)
	at org.apache.maven.plugin.PluginManager.attainGoals(PluginManager.java:693)
	at org.apache.maven.MavenSession.attainGoals(MavenSession.java:263)
	at org.apache.maven.cli.App.doMain(App.java:511)
	at org.apache.maven.cli.App.main(App.java:1258)
	at sun.reflect.NativeMethodAccessorImpl.invoke0(Native Method)
	at sun.reflect.NativeMethodAccessorImpl.invoke(NativeMethodAccessorImpl.java:39)
	at sun.reflect.DelegatingMethodAccessorImpl.invoke(DelegatingMethodAccessorImpl.java:25)
	at java.lang.reflect.Method.invoke(Method.java:324)
	at com.werken.forehead.Forehead.run(Forehead.java:551)
	at com.werken.forehead.Forehead.main(Forehead.java:581)
Invalid Redirect URI from: http://codehaus.org:80/~jgenender/maven2//geronimo/jars/geronimo-deploy-jsr88-1.0-SNAPSHOT.jar to: http://www.codehaus.org/~jgenender/maven2//geronimo/jars/geronimo-deploy-jsr88-1.0-SNAPSHOT.jar
Error retrieving artifact from [http://codehaus.org/~jgenender/maven2]: org.apache.maven.wagon.TransferFailedException: Failed to trasfer file: http://codehaus.org/~jgenender/maven2//geronimo/jars/geronimo-deploy-jsr88-1.0-SNAPSHOT.jar. Return code is: 302
build:start:

multiproject:install-callback:
    [echo] Running jar:install for Geronimo :: Deploy :: CLI Tool
java:prepare-filesystem:

java:compile:
<depend closure="false" srcdir="1.4" dump="false" destdir="/home/continuum/build/work/1/modules/deploy-tool/target/classes"></depend>    [echo] Compiling to /home/continuum/build/work/1/modules/deploy-tool/target/classes

java:jar-resources:

test:prepare-filesystem:

test:test-resources:

test:compile:

test:test:
    [echo] NOTICE: Skipping tests; they seem to have passed already
    [echo] No tests to run.
Running post goal: test:test

jar:jar:

jar:install:
    [echo] Installing...
Uploading to geronimo/jars/geronimo-deploy-tool-1.0-SNAPSHOT.jar: 
.................... (58K)
Uploading to geronimo/poms/geronimo-deploy-tool-1.0-SNAPSHOT.pom: 
.................... (11K)

+----------------------------------------
| geronimo and geronimo-plugins Geronimo :: Derby
| Memory: 12M/19M
+----------------------------------------
DEPRECATED: the default goal should be specified in the <build> section of project.xml instead of maven.xml

build:end:

build:start:

multiproject:install-callback:
    [echo] Running jar:install for Geronimo :: Derby
java:prepare-filesystem:

java:compile:
<depend closure="false" srcdir="1.4" dump="false" destdir="/home/continuum/build/work/1/modules/derby/target/classes"></depend>    [echo] Compiling to /home/continuum/build/work/1/modules/derby/target/classes

java:jar-resources:

test:prepare-filesystem:

test:test-resources:

test:compile:

test:test:
    [echo] NOTICE: Skipping tests; they seem to have passed already
    [echo] No tests to run.
Running post goal: test:test

jar:jar:

jar:install:
    [echo] Installing...
Uploading to geronimo/jars/geronimo-derby-1.0-SNAPSHOT.jar: 
.................... (12K)
Uploading to geronimo/poms/geronimo-derby-1.0-SNAPSHOT.pom: 
.................... (10K)

+----------------------------------------
| geronimo and geronimo-plugins Geronimo :: Directory
| Memory: 14M/19M
+----------------------------------------
DEPRECATED: the default goal should be specified in the <build> section of project.xml instead of maven.xml
DEPRECATED: the default goal should be specified in the <build> section of project.xml instead of maven.xml

build:end:

build:start:

multiproject:install-callback:
    [echo] Running jar:install for Geronimo :: Directory
java:prepare-filesystem:

java:compile:
<depend closure="false" srcdir="1.4" dump="false" destdir="/home/continuum/build/work/1/modules/directory/target/classes"></depend>    [echo] Compiling to /home/continuum/build/work/1/modules/directory/target/classes
Running post goal: java:compile
geronimo:dependency:


java:jar-resources:
Copying 1 file to /home/continuum/build/work/1/modules/directory/target/classes

test:prepare-filesystem:

test:test-resources:

test:compile:

test:test:
    [echo] NOTICE: Skipping tests; they seem to have passed already
    [echo] No tests to run.
Running post goal: test:test

jar:jar:
    [jar] Building jar: /home/continuum/build/work/1/modules/directory/target/geronimo-directory-1.0-SNAPSHOT.jar

jar:install:
    [echo] Installing...
Uploading to geronimo/jars/geronimo-directory-1.0-SNAPSHOT.jar: 
.................... (113K)
Uploading to geronimo/poms/geronimo-directory-1.0-SNAPSHOT.pom: 
.................... (16K)

+----------------------------------------
| geronimo and geronimo-plugins Geronimo :: Deploy :: Hot Deployer
| Memory: 14M/19M
+----------------------------------------
DEPRECATED: the default goal should be specified in the <build> section of project.xml instead of maven.xml
DEPRECATED: the default goal should be specified in the <build> section of project.xml instead of maven.xml

build:end:

Attempting to download geronimo-deploy-tool-1.0-SNAPSHOT.jar.
Error getting URI host
org.apache.commons.httpclient.HttpException: Redirect from host codehaus.org to www.codehaus.org is not supported
	at org.apache.commons.httpclient.HttpMethodBase.checkValidRedirect(HttpMethodBase.java:1237)
	at org.apache.commons.httpclient.HttpMethodBase.processRedirectResponse(HttpMethodBase.java:1185)
	at org.apache.commons.httpclient.HttpMethodBase.isRetryNeeded(HttpMethodBase.java:967)
	at org.apache.commons.httpclient.HttpMethodBase.execute(HttpMethodBase.java:1089)
	at org.apache.commons.httpclient.HttpClient.executeMethod(HttpClient.java:643)
	at org.apache.commons.httpclient.HttpClient.executeMethod(HttpClient.java:497)
	at org.apache.maven.wagon.providers.http.HttpWagon.get(HttpWagon.java:287)
	at org.apache.maven.wagon.providers.http.HttpWagon.getIfNewer(HttpWagon.java:234)
	at org.apache.maven.verifier.DependencyVerifier.getRemoteArtifact(DependencyVerifier.java:391)
	at org.apache.maven.verifier.DependencyVerifier.getDependencies(DependencyVerifier.java:291)
	at org.apache.maven.verifier.DependencyVerifier.satisfyDependencies(DependencyVerifier.java:182)
	at org.apache.maven.verifier.DependencyVerifier.verify(DependencyVerifier.java:99)
	at org.apache.maven.project.Project.verifyDependencies(Project.java:569)
	at org.apache.maven.plugin.PluginManager.attainGoals(PluginManager.java:663)
	at org.apache.maven.MavenSession.attainGoals(MavenSession.java:263)
	at org.apache.maven.jelly.tags.maven.ReactorTag.doTag(ReactorTag.java:368)
	at org.apache.commons.jelly.impl.TagScript.run(TagScript.java:247)
	at org.apache.commons.jelly.impl.ScriptBlock.run(ScriptBlock.java:95)
	at org.apache.maven.jelly.tags.werkz.MavenGoalTag.runBodyTag(MavenGoalTag.java:78)
	at org.apache.maven.jelly.tags.werkz.MavenGoalTag$MavenGoalAction.performAction(MavenGoalTag.java:109)
	at org.apache.maven.werkz.Goal.fire(Goal.java:656)
	at org.apache.maven.werkz.Goal.attain(Goal.java:592)
	at org.apache.maven.plugin.PluginManager.attainGoals(PluginManager.java:693)
	at org.apache.maven.MavenSession.attainGoals(MavenSession.java:263)
	at org.apache.maven.cli.App.doMain(App.java:511)
	at org.apache.maven.cli.App.main(App.java:1258)
	at sun.reflect.NativeMethodAccessorImpl.invoke0(Native Method)
	at sun.reflect.NativeMethodAccessorImpl.invoke(NativeMethodAccessorImpl.java:39)
	at sun.reflect.DelegatingMethodAccessorImpl.invoke(DelegatingMethodAccessorImpl.java:25)
	at java.lang.reflect.Method.invoke(Method.java:324)
	at com.werken.forehead.Forehead.run(Forehead.java:551)
	at com.werken.forehead.Forehead.main(Forehead.java:581)
Invalid Redirect URI from: http://codehaus.org:80/~jgenender/maven2//geronimo/jars/geronimo-deploy-tool-1.0-SNAPSHOT.jar to: http://www.codehaus.org/~jgenender/maven2//geronimo/jars/geronimo-deploy-tool-1.0-SNAPSHOT.jar
Error retrieving artifact from [http://codehaus.org/~jgenender/maven2]: org.apache.maven.wagon.TransferFailedException: Failed to trasfer file: http://codehaus.org/~jgenender/maven2//geronimo/jars/geronimo-deploy-tool-1.0-SNAPSHOT.jar. Return code is: 302
build:start:

multiproject:install-callback:
    [echo] Running jar:install for Geronimo :: Deploy :: Hot Deployer
java:prepare-filesystem:

java:compile:
<depend closure="false" srcdir="1.4" dump="false" destdir="/home/continuum/build/work/1/modules/hot-deploy/target/classes"></depend>    [echo] Compiling to /home/continuum/build/work/1/modules/hot-deploy/target/classes

java:jar-resources:

test:prepare-filesystem:

test:test-resources:

test:compile:
    [echo] No test source files to compile.

test:test:
    [echo] NOTICE: Skipping tests; they seem to have passed already
    [echo] No tests to run.
Running post goal: test:test

jar:jar:

jar:install:
    [echo] Installing...
Uploading to geronimo/jars/geronimo-hot-deploy-1.0-SNAPSHOT.jar: 
.................... (19K)
Uploading to geronimo/poms/geronimo-hot-deploy-1.0-SNAPSHOT.pom: 
.................... (11K)

+----------------------------------------
| geronimo and geronimo-plugins Geronimo :: JavaMail Transport
| Memory: 15M/19M
+----------------------------------------
DEPRECATED: the default goal should be specified in the <build> section of project.xml instead of maven.xml

build:end:

build:start:

multiproject:install-callback:
    [echo] Running jar:install for Geronimo :: JavaMail Transport
java:prepare-filesystem:

java:compile:
<depend closure="false" srcdir="1.4" dump="false" destdir="/home/continuum/build/work/1/modules/javamail-transport/target/classes"></depend>    [echo] Compiling to /home/continuum/build/work/1/modules/javamail-transport/target/classes

java:jar-resources:

test:prepare-filesystem:

test:test-resources:

test:compile:
    [echo] No test source files to compile.

test:test:
    [echo] NOTICE: Skipping tests; they seem to have passed already
    [echo] No tests to run.
Running post goal: test:test

jar:jar:

jar:install:
    [echo] Installing...
Uploading to geronimo/jars/geronimo-javamail-transport-1.0-SNAPSHOT.jar: 
.................... (13K)
Uploading to geronimo/poms/geronimo-javamail-transport-1.0-SNAPSHOT.pom: 
.................... (10K)

+----------------------------------------
| geronimo and geronimo-plugins Geronimo :: Jetty
| Memory: 15M/19M
+----------------------------------------
DEPRECATED: the default goal should be specified in the <build> section of project.xml instead of maven.xml
DEPRECATED: the default goal should be specified in the <build> section of project.xml instead of maven.xml

build:end:

Attempting to download activemq-WADI-3.2.jar.
Error getting URI host
org.apache.commons.httpclient.HttpException: Redirect from host codehaus.org to www.codehaus.org is not supported
	at org.apache.commons.httpclient.HttpMethodBase.checkValidRedirect(HttpMethodBase.java:1237)
	at org.apache.commons.httpclient.HttpMethodBase.processRedirectResponse(HttpMethodBase.java:1185)
	at org.apache.commons.httpclient.HttpMethodBase.isRetryNeeded(HttpMethodBase.java:967)
	at org.apache.commons.httpclient.HttpMethodBase.execute(HttpMethodBase.java:1089)
	at org.apache.commons.httpclient.HttpClient.executeMethod(HttpClient.java:643)
	at org.apache.commons.httpclient.HttpClient.executeMethod(HttpClient.java:497)
	at org.apache.maven.wagon.providers.http.HttpWagon.get(HttpWagon.java:287)
	at org.apache.maven.wagon.providers.http.HttpWagon.getIfNewer(HttpWagon.java:234)
	at org.apache.maven.verifier.DependencyVerifier.getRemoteArtifact(DependencyVerifier.java:391)
	at org.apache.maven.verifier.DependencyVerifier.getDependencies(DependencyVerifier.java:291)
	at org.apache.maven.verifier.DependencyVerifier.satisfyDependencies(DependencyVerifier.java:182)
	at org.apache.maven.verifier.DependencyVerifier.verify(DependencyVerifier.java:99)
	at org.apache.maven.project.Project.verifyDependencies(Project.java:569)
	at org.apache.maven.plugin.PluginManager.attainGoals(PluginManager.java:663)
	at org.apache.maven.MavenSession.attainGoals(MavenSession.java:263)
	at org.apache.maven.jelly.tags.maven.ReactorTag.doTag(ReactorTag.java:368)
	at org.apache.commons.jelly.impl.TagScript.run(TagScript.java:247)
	at org.apache.commons.jelly.impl.ScriptBlock.run(ScriptBlock.java:95)
	at org.apache.maven.jelly.tags.werkz.MavenGoalTag.runBodyTag(MavenGoalTag.java:78)
	at org.apache.maven.jelly.tags.werkz.MavenGoalTag$MavenGoalAction.performAction(MavenGoalTag.java:109)
	at org.apache.maven.werkz.Goal.fire(Goal.java:656)
	at org.apache.maven.werkz.Goal.attain(Goal.java:592)
	at org.apache.maven.plugin.PluginManager.attainGoals(PluginManager.java:693)
	at org.apache.maven.MavenSession.attainGoals(MavenSession.java:263)
	at org.apache.maven.cli.App.doMain(App.java:511)
	at org.apache.maven.cli.App.main(App.java:1258)
	at sun.reflect.NativeMethodAccessorImpl.invoke0(Native Method)
	at sun.reflect.NativeMethodAccessorImpl.invoke(NativeMethodAccessorImpl.java:39)
	at sun.reflect.DelegatingMethodAccessorImpl.invoke(DelegatingMethodAccessorImpl.java:25)
	at java.lang.reflect.Method.invoke(Method.java:324)
	at com.werken.forehead.Forehead.run(Forehead.java:551)
	at com.werken.forehead.Forehead.main(Forehead.java:581)
Invalid Redirect URI from: http://codehaus.org:80/~jgenender/maven2//activemq/jars/activemq-WADI-3.2.jar to: http://www.codehaus.org/~jgenender/maven2//activemq/jars/activemq-WADI-3.2.jar
Error retrieving artifact from [http://codehaus.org/~jgenender/maven2]: org.apache.maven.wagon.TransferFailedException: Failed to trasfer file: http://codehaus.org/~jgenender/maven2//activemq/jars/activemq-WADI-3.2.jar. Return code is: 302
WARNING: Failed to download activemq-WADI-3.2.jar.

BUILD FAILED
File...... /home/continuum/build/work/1/maven.xml
Element... maven:reactor
Line...... 43
Column.... -1
The build cannot continue because of the following unsatisfied dependency:

activemq-WADI-3.2.jar

Total time   : 1 minutes 51 seconds 
Finished at  : Friday, January 6, 2006 10:02:32 PM PST


****************************************************************************



Mime
View raw message