geronimo-scm mailing list archives

Site index · List index
Message view « Date » · « Thread »
Top « Date » · « Thread »
From continuum <contin...@stan.gbuild.org>
Subject [continuum] BUILD FAILURE: GBuild Agent
Date Tue, 17 Jan 2006 04:10:02 GMT
Online report : http://ci.gbuild.org/continuum/target/ProjectBuild.vm/view/ProjectBuild/id/17/buildId/832
Build statistics:
  State: Failed
  Previous State: Error
  Started at: Mon, 16 Jan 2006 20:06:35 -0800
  Finished at: Mon, 16 Jan 2006 20:10:02 -0800
  Total time: 3m 26s
  Build Trigger: Forced
  Exit code: 1
  Building machine hostname: stan.gbuild.org
  Operating system : Linux(unknown)
  Java version : 1.4.2_08(Sun Microsystems Inc.)

Changes
                            src/main/java/org/apache/geronimo/gbuild/agent/MockContinuumStore.java
            src/main/java/org/apache/geronimo/gbuild/agent/ThreadContextContinuumStore.java
            pom.xml
        
****************************************************************************
Output:
****************************************************************************
[INFO] Scanning for projects...
[INFO] ----------------------------------------------------------------------------
[INFO] Building GBuild Agent
[INFO]    task-segment: [clean, install]
[INFO] ----------------------------------------------------------------------------
[INFO] [clean:clean]
[INFO] Deleting directory /home/continuum/build/work/17/target
[INFO] [plexus:descriptor {execution: default}]
[INFO] [resources:resources]
[INFO] Using default encoding to copy filtered resources.
[INFO] snapshot org.apache.maven.scm:maven-scm-provider-cvs:1.0-beta-1-SNAPSHOT: checking
for updates from apache
[INFO] snapshot org.apache.maven.scm:maven-scm-provider-cvs:1.0-beta-1-SNAPSHOT: checking
for updates from snapshots
[INFO] snapshot org.apache.maven.scm:maven-scm-providers:1.0-beta-1-SNAPSHOT: checking for
updates from apache
[INFO] snapshot org.apache.maven.scm:maven-scm-providers:1.0-beta-1-SNAPSHOT: checking for
updates from snapshots
[INFO] snapshot org.apache.maven.scm:maven-scm:1.0-beta-1-SNAPSHOT: checking for updates from
apache
[INFO] snapshot org.apache.maven.scm:maven-scm:1.0-beta-1-SNAPSHOT: checking for updates from
snapshots
[INFO] snapshot org.apache.maven.scm:maven-scm-api:1.0-beta-1-SNAPSHOT: checking for updates
from apache
[INFO] snapshot org.apache.maven.scm:maven-scm-api:1.0-beta-1-SNAPSHOT: checking for updates
from snapshots
[WARNING] 
	Artifact junit:junit:jar:3.8.1 retains local scope 'test' overriding broader scope 'compile'
	given by a dependency. If this is not intended, modify or remove the local scope.

[INFO] snapshot org.apache.maven.continuum:continuum-core:1.1-SNAPSHOT: checking for updates
from apache
[INFO] snapshot org.apache.maven.continuum:continuum-core:1.1-SNAPSHOT: checking for updates
from snapshots
[INFO] snapshot org.apache.maven.continuum:continuum-parent:1.1-SNAPSHOT: checking for updates
from apache.snapshots
[INFO] snapshot org.apache.maven.continuum:continuum-parent:1.1-SNAPSHOT: checking for updates
from apache
[INFO] snapshot org.apache.maven.continuum:continuum-parent:1.1-SNAPSHOT: checking for updates
from snapshots
[INFO] snapshot org.apache.maven.continuum:continuum-notifier-api:1.1-SNAPSHOT: checking for
updates from apache
[INFO] snapshot org.apache.maven.continuum:continuum-notifier-api:1.1-SNAPSHOT: checking for
updates from snapshots
[INFO] snapshot org.apache.maven.continuum:continuum-parent-notifiers:1.1-SNAPSHOT: checking
for updates from apache
[INFO] snapshot org.apache.maven.continuum:continuum-parent-notifiers:1.1-SNAPSHOT: checking
for updates from snapshots
[INFO] snapshot org.apache.maven.continuum:continuum-api:1.1-SNAPSHOT: checking for updates
from apache
[INFO] snapshot org.apache.maven.continuum:continuum-api:1.1-SNAPSHOT: checking for updates
from snapshots
[INFO] snapshot org.apache.maven.continuum:continuum-model:1.1-SNAPSHOT: checking for updates
from apache
[INFO] snapshot org.apache.maven.continuum:continuum-model:1.1-SNAPSHOT: checking for updates
from snapshots
[INFO] snapshot org.apache.maven.scm:maven-scm-manager-plexus:1.0-beta-1-SNAPSHOT: checking
for updates from apache
[INFO] snapshot org.apache.maven.scm:maven-scm-manager-plexus:1.0-beta-1-SNAPSHOT: checking
for updates from snapshots
[INFO] snapshot org.apache.maven.scm:maven-scm-managers:1.0-beta-1-SNAPSHOT: checking for
updates from apache
[INFO] snapshot org.apache.maven.scm:maven-scm-managers:1.0-beta-1-SNAPSHOT: checking for
updates from snapshots
[INFO] snapshot org.apache.maven.scm:maven-scm-provider-svn:1.0-beta-1-SNAPSHOT: checking
for updates from apache
[INFO] snapshot org.apache.maven.scm:maven-scm-provider-svn:1.0-beta-1-SNAPSHOT: checking
for updates from snapshots
[WARNING] 
  This artifact has been relocated to javax.jdo:jdo:2.0-20050809.1515.


[WARNING] 
  This artifact has been relocated to xml-apis:xml-apis:1.0.b2.


[WARNING] 
  This artifact has been relocated to xml-apis:xml-apis:1.0.b2.


[INFO] snapshot org.apache.maven.continuum:continuum-store:1.1-SNAPSHOT: checking for updates
from apache
[INFO] snapshot org.apache.maven.continuum:continuum-store:1.1-SNAPSHOT: checking for updates
from snapshots
[WARNING] POM for: 'activeio:activeio:pom:2.1' does not appear to be valid. Its will be ignored
for artifact resolution.

Reason: Invalid POM (not v4.0.0 modelVersion)


Downloading: http://cvs.apache.org/repository/incubator-activemq/poms/activemq-core-4.0-20060114.225444.pom
[WARNING] Unable to get resource from repository apache (http://cvs.apache.org/repository)
Downloading: http://repo1.maven.org/maven2/incubator-activemq/activemq-core/4.0-20060114.225444/activemq-core-4.0-20060114.225444.pom
[WARNING] Unable to get resource from repository central (http://repo1.maven.org/maven2)
Downloading: http://cvs.apache.org/repository/incubator-activemq/jars/activemq-core-4.0-20060114.225444.jar
1013K downloaded
[INFO] [compiler:compile]
Compiling 36 source files to /home/continuum/build/work/17/target/classes
[INFO] ----------------------------------------------------------------------------
[ERROR] BUILD FAILURE
[INFO] ----------------------------------------------------------------------------
[INFO] Compilation failure

/home/continuum/build/work/17/src/main/java/org/apache/geronimo/gbuild/agent/ThreadContextContinuumStore.java:[67,23]
cannot resolve symbol
symbol  : method getDefaultBuildDefinitions ()
location: interface org.apache.maven.continuum.store.ContinuumStore

/home/continuum/build/work/17/src/main/java/org/apache/geronimo/gbuild/agent/ThreadContextContinuumStore.java:[71,23]
cannot resolve symbol
symbol  : method getDefaultBuildDefinition (int)
location: interface org.apache.maven.continuum.store.ContinuumStore

/home/continuum/build/work/17/src/main/java/org/apache/geronimo/gbuild/agent/ThreadContextContinuumStore.java:[147,23]
cannot resolve symbol
symbol  : method getProjectIdsAndBuildDefinitionIdsBySchedule (int)
location: interface org.apache.maven.continuum.store.ContinuumStore

/home/continuum/build/work/17/src/main/java/org/apache/geronimo/gbuild/agent/ThreadContextContinuumStore.java:[223,23]
cannot resolve symbol
symbol  : method getLatestBuildResults ()
location: interface org.apache.maven.continuum.store.ContinuumStore

/home/continuum/build/work/17/src/main/java/org/apache/geronimo/gbuild/agent/ThreadContextContinuumStore.java:[227,23]
cannot resolve symbol
symbol  : method getBuildResultByBuildNumber (int,int)
location: interface org.apache.maven.continuum.store.ContinuumStore

/home/continuum/build/work/17/src/main/java/org/apache/geronimo/gbuild/agent/ThreadContextContinuumStore.java:[231,23]
cannot resolve symbol
symbol  : method getBuildResultsInSuccess ()
location: interface org.apache.maven.continuum.store.ContinuumStore


[INFO] ----------------------------------------------------------------------------
[INFO] For more information, run Maven with the -e switch
[INFO] ----------------------------------------------------------------------------
[INFO] Total time: 3 minutes 25 seconds
[INFO] Finished at: Mon Jan 16 20:10:02 PST 2006
[INFO] Final Memory: 8M/20M
[INFO] ----------------------------------------------------------------------------

****************************************************************************



Mime
View raw message