geronimo-scm mailing list archives

Site index · List index
Message view « Date » · « Thread »
Top « Date » · « Thread »
From continuum <contin...@stan.gbuild.org>
Subject [continuum] BUILD FAILURE: Geronimo
Date Sat, 17 Dec 2005 16:01:44 GMT
Online report : http://ci.gbuild.org/continuum/target/ProjectBuild.vm/view/ProjectBuild/id/1/buildId/523
Build statistics:
  State: Failed
  Previous State: Failed
  Started at: Sat, 17 Dec 2005 08:00:13 -0800
  Finished at: Sat, 17 Dec 2005 08:01:42 -0800
  Total time: 1m 28s
  Build Trigger: Schedule
  Exit code: 70
  Building machine hostname: stan.gbuild.org
  Operating system : Linux(unknown)
  Java version : 1.4.2_08(Sun Microsystems Inc.)

Changes
                            applications/console-standard/src/java/org/apache/geronimo/console/internaldb/DerbyConnectionUtil.java
        
****************************************************************************
Output:
****************************************************************************
 __  __
|  \/  |__ _Apache__ ___
| |\/| / _` \ V / -_) ' \  ~ intelligent projects ~
|_|  |_\__,_|\_/\___|_||_|  v. 1.1-beta-2

DEPRECATED: the default goal should be specified in the <build> section of project.xml
instead of maven.xml
DEPRECATED: the default goal should be specified in the <build> section of project.xml
instead of maven.xml
Starting the reactor...
Our processing order:
Geronimo :: Activation
Geronimo :: Kernel
Geronimo :: Common
Geronimo :: Util
Geronimo :: System
Geronimo :: Deployment
Geronimo :: Core
Geronimo :: Management API
Geronimo :: J2EE
Geronimo :: J2EE Schema
Geronimo :: Service :: Builder
Geronimo :: Maven Dependency Plugin
Geronimo :: Security
Geronimo :: Web Services
Geronimo :: Axis
Geronimo :: Naming
Geronimo :: Deploy :: Common Config
Geronimo :: Test :: DDBeans
Geronimo :: Transaction
Geronimo :: Connector
Geronimo :: Security :: Builder
Geronimo :: J2EE
Geronimo :: Naming :: Builder
Geronimo :: Connector :: Builder
Geronimo :: Axis :: Builder
Geronimo :: Client
Geronimo :: Client Builder
Geronimo :: Console Web
Geronimo :: Configuration Converter
Geronimo :: Web :: Builder
Geronimo :: Deploy :: JSR-88
Geronimo :: Deploy :: CLI Tool
Geronimo :: Derby
Geronimo :: Directory
Geronimo :: Deploy :: Hot Deployer
Geronimo :: JavaMail Transport
Geronimo :: Jetty
Geronimo :: Jetty :: Builder
Geronimo :: JMX Remoting
Geronimo :: Mail
Geronimo :: Scripts
Geronimo :: Timer
Geronimo :: Tomcat
Geronimo :: Tomcat :: Builder
Geronimo :: Maven Assembly Plugin
Geronimo :: Maven Deployment Plugin
Geronimo :: IZPack Installer Build Plugin
Geronimo :: Maven Packaging Plugin
+----------------------------------------
| geronimo and geronimo-plugins Geronimo :: Activation
| Memory: 4M/10M
+----------------------------------------
DEPRECATED: the default goal should be specified in the <build> section of project.xml
instead of maven.xml
build:start:

new1:
build:start:

multiproject:install-callback:
    [echo] Running jar:install for Geronimo :: Activation
java:prepare-filesystem:

java:compile:
<depend closure="false" srcdir="1.4" dump="false" destdir="/home/continuum/build/work/1/modules/activation/target/classes"></depend>
   [echo] Compiling to /home/continuum/build/work/1/modules/activation/target/classes

java:jar-resources:

test:prepare-filesystem:

test:test-resources:

test:compile:

test:test:
    [echo] NOTICE: Skipping tests; they seem to have passed already
    [echo] No tests to run.
Running post goal: test:test

jar:jar:

jar:install:
    [echo] Installing...
Uploading to geronimo/jars/geronimo-activation-1.0-SNAPSHOT.jar: 
.................... (13K)
Uploading to geronimo/poms/geronimo-activation-1.0-SNAPSHOT.pom: 
.................... (10K)

+----------------------------------------
| geronimo and geronimo-plugins Geronimo :: Kernel
| Memory: 8M/10M
+----------------------------------------
DEPRECATED: the default goal should be specified in the <build> section of project.xml
instead of maven.xml
DEPRECATED: the default goal should be specified in the <build> section of project.xml
instead of maven.xml

build:end:

build:start:

multiproject:install-callback:
    [echo] Running jar:install for Geronimo :: Kernel
Tag library requested that is not present: 'xmlbeans2:maven' in plugin: 'null'
java:prepare-filesystem:

java:compile:
<depend closure="false" srcdir="1.4" dump="false" destdir="/home/continuum/build/work/1/modules/kernel/target/classes"></depend>
   [echo] Compiling to /home/continuum/build/work/1/modules/kernel/target/classes

java:jar-resources:

test:prepare-filesystem:

test:test-resources:

test:compile:

test:test:
    [echo] NOTICE: Skipping tests; they seem to have passed already
    [echo] No tests to run.
Running post goal: test:test

jar:jar:

jar:install:
    [echo] Installing...
Uploading to geronimo/jars/geronimo-kernel-1.0-SNAPSHOT.jar: 
.................... (223K)
Uploading to geronimo/poms/geronimo-kernel-1.0-SNAPSHOT.pom: 
.................... (10K)

+----------------------------------------
| geronimo and geronimo-plugins Geronimo :: Common
| Memory: 9M/10M
+----------------------------------------
DEPRECATED: the default goal should be specified in the <build> section of project.xml
instead of maven.xml

build:end:

Attempting to download geronimo-kernel-1.0-SNAPSHOT.jar.
build:start:

multiproject:install-callback:
    [echo] Running jar:install for Geronimo :: Common
java:prepare-filesystem:

java:compile:
<depend closure="false" srcdir="1.4" dump="false" destdir="/home/continuum/build/work/1/modules/common/target/classes"></depend>
   [echo] Compiling to /home/continuum/build/work/1/modules/common/target/classes

java:jar-resources:

test:prepare-filesystem:

test:test-resources:

test:compile:

test:test:
    [echo] NOTICE: Skipping tests; they seem to have passed already
    [echo] No tests to run.
Running post goal: test:test

jar:jar:

jar:install:
    [echo] Installing...
Uploading to geronimo/jars/geronimo-common-1.0-SNAPSHOT.jar: 
.................... (35K)
Uploading to geronimo/poms/geronimo-common-1.0-SNAPSHOT.pom: 
.................... (9K)

+----------------------------------------
| geronimo and geronimo-plugins Geronimo :: Util
| Memory: 9M/14M
+----------------------------------------
DEPRECATED: the default goal should be specified in the <build> section of project.xml
instead of maven.xml

build:end:

build:start:

multiproject:install-callback:
    [echo] Running jar:install for Geronimo :: Util
java:prepare-filesystem:

java:compile:
<depend closure="false" srcdir="1.4" dump="false" destdir="/home/continuum/build/work/1/modules/util/target/classes"></depend>
   [echo] Compiling to /home/continuum/build/work/1/modules/util/target/classes

java:jar-resources:

test:prepare-filesystem:

test:test-resources:

test:compile:

test:test:
    [echo] NOTICE: Skipping tests; they seem to have passed already
    [echo] No tests to run.
Running post goal: test:test

jar:jar:

jar:install:
    [echo] Installing...
Uploading to geronimo/jars/geronimo-util-1.0-SNAPSHOT.jar: 
.................... (242K)
Uploading to geronimo/poms/geronimo-util-1.0-SNAPSHOT.pom: 
.................... (9K)

+----------------------------------------
| geronimo and geronimo-plugins Geronimo :: System
| Memory: 9M/14M
+----------------------------------------
DEPRECATED: the default goal should be specified in the <build> section of project.xml
instead of maven.xml
DEPRECATED: the default goal should be specified in the <build> section of project.xml
instead of maven.xml

build:end:

Attempting to download geronimo-common-1.0-SNAPSHOT.jar.
Attempting to download geronimo-util-1.0-SNAPSHOT.jar.
build:start:

multiproject:install-callback:
    [echo] Running jar:install for Geronimo :: System
java:prepare-filesystem:

java:compile:
<depend closure="false" srcdir="1.4" dump="false" destdir="/home/continuum/build/work/1/modules/system/target/classes"></depend>
   [echo] Compiling to /home/continuum/build/work/1/modules/system/target/classes
Running post goal: java:compile

java:jar-resources:

test:prepare-filesystem:

test:test-resources:
Running post goal: test:test-resources
    [delete] Deleting directory /home/continuum/build/work/1/modules/system/target/tmp
    [mkdir] Created dir: /home/continuum/build/work/1/modules/system/target/tmp

test:compile:

test:test:
    [echo] NOTICE: Skipping tests; they seem to have passed already
    [echo] No tests to run.
Running post goal: test:test

jar:jar:
    [jar] Building jar: /home/continuum/build/work/1/modules/system/target/geronimo-system-1.0-SNAPSHOT.jar

jar:install:
    [echo] Installing...
Uploading to geronimo/jars/geronimo-system-1.0-SNAPSHOT.jar: 
.................... (142K)
Uploading to geronimo/poms/geronimo-system-1.0-SNAPSHOT.pom: 
.................... (10K)

+----------------------------------------
| geronimo and geronimo-plugins Geronimo :: Deployment
| Memory: 11M/14M
+----------------------------------------
DEPRECATED: the default goal should be specified in the <build> section of project.xml
instead of maven.xml
DEPRECATED: the default goal should be specified in the <build> section of project.xml
instead of maven.xml

build:end:

Attempting to download geronimo-system-1.0-SNAPSHOT.jar.
build:start:

multiproject:install-callback:
    [echo] Running jar:install for Geronimo :: Deployment
java:prepare-filesystem:

java:compile:
<depend closure="false" srcdir="1.4" dump="false" destdir="/home/continuum/build/work/1/modules/deployment/target/classes"></depend>
   [echo] Compiling to /home/continuum/build/work/1/modules/deployment/target/classes

java:jar-resources:

test:prepare-filesystem:

test:test-resources:

test:compile:

test:test:
    [echo] NOTICE: Skipping tests; they seem to have passed already
    [echo] No tests to run.
Running post goal: test:test

jar:jar:

jar:install:
    [echo] Installing...
Uploading to geronimo/jars/geronimo-deployment-1.0-SNAPSHOT.jar: 
.................... (51K)
Uploading to geronimo/poms/geronimo-deployment-1.0-SNAPSHOT.pom: 
.................... (10K)

+----------------------------------------
| geronimo and geronimo-plugins Geronimo :: Core
| Memory: 12M/14M
+----------------------------------------
DEPRECATED: the default goal should be specified in the <build> section of project.xml
instead of maven.xml
DEPRECATED: the default goal should be specified in the <build> section of project.xml
instead of maven.xml

build:end:

build:start:

multiproject:install-callback:
    [echo] Running jar:install for Geronimo :: Core
java:prepare-filesystem:

java:compile:
<depend closure="false" srcdir="1.4" dump="false" destdir="/home/continuum/build/work/1/modules/core/target/classes"></depend>
   [echo] Compiling to /home/continuum/build/work/1/modules/core/target/classes

java:jar-resources:

test:prepare-filesystem:

test:test-resources:

test:compile:

test:test:
    [echo] NOTICE: Skipping tests; they seem to have passed already
    [echo] No tests to run.
Running post goal: test:test

jar:jar:

jar:install:
    [echo] Installing...
Uploading to geronimo/jars/geronimo-core-1.0-SNAPSHOT.jar: 
.................... (35K)
Uploading to geronimo/poms/geronimo-core-1.0-SNAPSHOT.pom: 
.................... (10K)

+----------------------------------------
| geronimo and geronimo-plugins Geronimo :: Management API
| Memory: 13M/14M
+----------------------------------------
DEPRECATED: the default goal should be specified in the <build> section of project.xml
instead of maven.xml
DEPRECATED: the default goal should be specified in the <build> section of project.xml
instead of maven.xml

build:end:

build:start:

multiproject:install-callback:
    [echo] Running jar:install for Geronimo :: Management API
java:prepare-filesystem:

java:compile:
<depend closure="false" srcdir="1.4" dump="false" destdir="/home/continuum/build/work/1/modules/management/target/classes"></depend>
   [echo] Compiling to /home/continuum/build/work/1/modules/management/target/classes

java:jar-resources:

test:prepare-filesystem:

test:test-resources:

test:compile:
    [echo] No test source files to compile.

test:test:
    [echo] NOTICE: Skipping tests; they seem to have passed already
    [echo] No tests to run.
Running post goal: test:test

jar:jar:

jar:install:
    [echo] Installing...
Uploading to geronimo/jars/geronimo-management-1.0-SNAPSHOT.jar: 
.................... (34K)
Uploading to geronimo/poms/geronimo-management-1.0-SNAPSHOT.pom: 
.................... (9K)

+----------------------------------------
| geronimo and geronimo-plugins Geronimo :: J2EE
| Memory: 8M/14M
+----------------------------------------
DEPRECATED: the default goal should be specified in the <build> section of project.xml
instead of maven.xml
DEPRECATED: the default goal should be specified in the <build> section of project.xml
instead of maven.xml

build:end:

Attempting to download geronimo-core-1.0-SNAPSHOT.jar.
Attempting to download geronimo-management-1.0-SNAPSHOT.jar.
build:start:

multiproject:install-callback:
    [echo] Running jar:install for Geronimo :: J2EE
java:prepare-filesystem:

java:compile:
<depend closure="false" srcdir="1.4" dump="false" destdir="/home/continuum/build/work/1/modules/j2ee/target/classes"></depend>
   [echo] Compiling to /home/continuum/build/work/1/modules/j2ee/target/classes

java:jar-resources:

test:prepare-filesystem:

test:test-resources:

test:compile:

test:test:
    [echo] NOTICE: Skipping tests; they seem to have passed already
    [echo] No tests to run.
Running post goal: test:test

jar:jar:

jar:install:
    [echo] Installing...
Uploading to geronimo/jars/geronimo-j2ee-1.0-SNAPSHOT.jar: 
.................... (30K)
Uploading to geronimo/poms/geronimo-j2ee-1.0-SNAPSHOT.pom: 
.................... (11K)

+----------------------------------------
| geronimo and geronimo-plugins Geronimo :: J2EE Schema
| Memory: 9M/14M
+----------------------------------------
DEPRECATED: the default goal should be specified in the <build> section of project.xml
instead of maven.xml
DEPRECATED: the default goal should be specified in the <build> section of project.xml
instead of maven.xml

build:end:

build:start:

multiproject:install-callback:
    [echo] Running jar:install for Geronimo :: J2EE Schema
java:prepare-filesystem:

java:compile:
<depend closure="false" srcdir="1.4" dump="false" destdir="/home/continuum/build/work/1/modules/j2ee-schema/target/classes"></depend>
   [echo] Compiling to /home/continuum/build/work/1/modules/j2ee-schema/target/classes

java:jar-resources:

test:prepare-filesystem:

test:test-resources:

test:compile:

test:test:
    [echo] NOTICE: Skipping tests; they seem to have passed already
    [echo] No tests to run.
Running post goal: test:test

jar:jar:

jar:install:
    [echo] Installing...
Uploading to geronimo/jars/geronimo-j2ee-schema-1.0-SNAPSHOT.jar: 
.................... (1501K)
Uploading to geronimo/poms/geronimo-j2ee-schema-1.0-SNAPSHOT.pom: 
.................... (10K)

+----------------------------------------
| geronimo and geronimo-plugins Geronimo :: Service :: Builder
| Memory: 13M/14M
+----------------------------------------
DEPRECATED: the default goal should be specified in the <build> section of project.xml
instead of maven.xml
DEPRECATED: the default goal should be specified in the <build> section of project.xml
instead of maven.xml

build:end:

Attempting to download geronimo-deployment-1.0-SNAPSHOT.jar.
Attempting to download geronimo-j2ee-1.0-SNAPSHOT.jar.
Attempting to download geronimo-j2ee-schema-1.0-SNAPSHOT.jar.
build:start:

multiproject:install-callback:
    [echo] Running jar:install for Geronimo :: Service :: Builder
java:prepare-filesystem:

java:compile:
<depend closure="false" srcdir="1.4" dump="false" destdir="/home/continuum/build/work/1/modules/service-builder/target/classes"></depend>
   [echo] Compiling to /home/continuum/build/work/1/modules/service-builder/target/classes

java:jar-resources:

test:prepare-filesystem:

test:test-resources:

test:compile:

test:test:
    [echo] NOTICE: Skipping tests; they seem to have passed already
    [echo] No tests to run.
Running post goal: test:test

jar:jar:

jar:install:
    [echo] Installing...
Uploading to geronimo/jars/geronimo-service-builder-1.0-SNAPSHOT.jar: 
.................... (190K)
Uploading to geronimo/poms/geronimo-service-builder-1.0-SNAPSHOT.pom: 
.................... (11K)

+----------------------------------------
| geronimo and geronimo-plugins Geronimo :: Maven Dependency Plugin
| Memory: 10M/16M
+----------------------------------------
DEPRECATED: the default goal should be specified in the <build> section of project.xml
instead of maven.xml

build:end:

Attempting to download geronimo-service-builder-1.0-SNAPSHOT.jar.
Artifact /geronimo/jars/geronimo-service-builder-1.0-SNAPSHOT.jar doesn't exist in remote
repository, but it exists locally.
build:start:

multiproject:install-callback:
    [echo] Running plugin:repository-install for Geronimo :: Maven Dependency Plugin
plugin:plugin:
java:prepare-filesystem:

java:compile:
    [echo] Compiling to /home/continuum/build/work/1/plugins/geronimo-dependency-plugin/target/classes

java:jar-resources:

test:prepare-filesystem:

test:test-resources:

test:compile:
    [echo] No test source files to compile.

test:test:
    [echo] No tests to run.

jar:jar:


plugin:repository-install:
    [echo] Installing...
Uploading to geronimo/plugins/geronimo-dependency-plugin-1.1.0.jar: 
.................... (9K)
Uploading to geronimo/poms/geronimo-dependency-plugin-1.1.0.pom: 
.................... (1K)

+----------------------------------------
| geronimo and geronimo-plugins Geronimo :: Security
| Memory: 11M/16M
+----------------------------------------
DEPRECATED: the default goal should be specified in the <build> section of project.xml
instead of maven.xml
DEPRECATED: the default goal should be specified in the <build> section of project.xml
instead of maven.xml

build:end:

build:start:

multiproject:install-callback:
    [echo] Running jar:install for Geronimo :: Security
java:prepare-filesystem:

java:compile:
<depend closure="false" srcdir="1.4" dump="false" destdir="/home/continuum/build/work/1/modules/security/target/classes"></depend>
   [echo] Compiling to /home/continuum/build/work/1/modules/security/target/classes

java:jar-resources:

test:prepare-filesystem:

test:test-resources:
Running post goal: test:test-resources
    [delete] Deleting directory /home/continuum/build/work/1/modules/security/target/database
    [mkdir] Created dir: /home/continuum/build/work/1/modules/security/target/database

test:compile:

test:test:
    [echo] NOTICE: Skipping tests; they seem to have passed already
    [echo] No tests to run.
Running post goal: test:test

jar:jar:

jar:install:
    [echo] Installing...
Uploading to geronimo/jars/geronimo-security-1.0-SNAPSHOT.jar: 
.................... (169K)
Uploading to geronimo/poms/geronimo-security-1.0-SNAPSHOT.pom: 
.................... (12K)

+----------------------------------------
| geronimo and geronimo-plugins Geronimo :: Web Services
| Memory: 12M/16M
+----------------------------------------
DEPRECATED: the default goal should be specified in the <build> section of project.xml
instead of maven.xml

build:end:

build:start:

multiproject:install-callback:
    [echo] Running jar:install for Geronimo :: Web Services
java:prepare-filesystem:

java:compile:
<depend closure="false" srcdir="1.4" dump="false" destdir="/home/continuum/build/work/1/modules/webservices/target/classes"></depend>
   [echo] Compiling to /home/continuum/build/work/1/modules/webservices/target/classes

java:jar-resources:

test:prepare-filesystem:

test:test-resources:

test:compile:
    [echo] No test source files to compile.

test:test:
    [echo] NOTICE: Skipping tests; they seem to have passed already
    [echo] No tests to run.
Running post goal: test:test

jar:jar:

jar:install:
    [echo] Installing...
Uploading to geronimo/jars/geronimo-webservices-1.0-SNAPSHOT.jar: 
.................... (34K)
Uploading to geronimo/poms/geronimo-webservices-1.0-SNAPSHOT.pom: 
.................... (11K)

+----------------------------------------
| geronimo and geronimo-plugins Geronimo :: Axis
| Memory: 13M/16M
+----------------------------------------
DEPRECATED: the default goal should be specified in the <build> section of project.xml
instead of maven.xml
DEPRECATED: the default goal should be specified in the <build> section of project.xml
instead of maven.xml

build:end:

Attempting to download geronimo-security-1.0-SNAPSHOT.jar.
Attempting to download geronimo-webservices-1.0-SNAPSHOT.jar.
Attempting to download axis-1.4-SNAPSHOT.jar.
2/1570K
3/1570K
5/1570K
6/1570K
8/1570K
9/1570K
11/1570K
12/1570K
13/1570K
15/1570K
16/1570K
18/1570K
19/1570K
20/1570K
22/1570K
23/1570K
25/1570K
26/1570K
27/1570K
29/1570K
30/1570K
32/1570K
33/1570K
35/1570K
36/1570K
37/1570K
39/1570K
40/1570K
42/1570K
43/1570K
44/1570K
48/1570K
52/1570K
53/1570K
57/1570K
57/1570K
59/1570K
60/1570K
61/1570K
63/1570K
64/1570K
66/1570K
67/1570K
68/1570K
70/1570K
71/1570K
73/1570K
74/1570K
76/1570K
77/1570K
78/1570K
80/1570K
81/1570K
83/1570K
84/1570K
85/1570K
87/1570K
88/1570K
90/1570K
91/1570K
93/1570K
94/1570K
98/1570K
102/1570K
106/1570K
107/1570K
108/1570K
109/1570K
111/1570K
112/1570K
114/1570K
115/1570K
117/1570K
118/1570K
119/1570K
121/1570K
122/1570K
126/1570K
130/1570K
134/1570K
135/1570K
136/1570K
138/1570K
139/1570K
141/1570K
145/1570K
149/1570K
149/1570K
150/1570K
152/1570K
153/1570K
155/1570K
156/1570K
158/1570K
159/1570K
160/1570K
162/1570K
163/1570K
165/1570K
166/1570K
167/1570K
169/1570K
170/1570K
172/1570K
173/1570K
175/1570K
176/1570K
177/1570K
179/1570K
180/1570K
182/1570K
183/1570K
184/1570K
186/1570K
187/1570K
189/1570K
190/1570K
192/1570K
193/1570K
194/1570K
196/1570K
197/1570K
199/1570K
200/1570K
201/1570K
203/1570K
204/1570K
206/1570K
210/1570K
214/1570K
214/1570K
218/1570K
218/1570K
220/1570K
221/1570K
223/1570K
224/1570K
225/1570K
227/1570K
228/1570K
230/1570K
231/1570K
233/1570K
234/1570K
235/1570K
237/1570K
238/1570K
240/1570K
241/1570K
242/1570K
244/1570K
245/1570K
247/1570K
248/1570K
249/1570K
251/1570K
252/1570K
254/1570K
255/1570K
257/1570K
258/1570K
259/1570K
261/1570K
262/1570K
264/1570K
265/1570K
269/1570K
273/1570K
274/1570K
278/1570K
278/1570K
279/1570K
281/1570K
282/1570K
283/1570K
285/1570K
286/1570K
288/1570K
289/1570K
290/1570K
292/1570K
293/1570K
295/1570K
296/1570K
298/1570K
299/1570K
300/1570K
302/1570K
303/1570K
305/1570K
306/1570K
307/1570K
309/1570K
310/1570K
312/1570K
313/1570K
315/1570K
316/1570K
317/1570K
319/1570K
320/1570K
322/1570K
323/1570K
324/1570K
328/1570K
332/1570K
336/1570K
337/1570K
339/1570K
340/1570K
341/1570K
343/1570K
344/1570K
346/1570K
347/1570K
348/1570K
350/1570K
351/1570K
353/1570K
354/1570K
356/1570K
357/1570K
358/1570K
360/1570K
361/1570K
365/1570K
369/1570K
373/1570K
374/1570K
375/1570K
377/1570K
378/1570K
380/1570K
381/1570K
382/1570K
384/1570K
385/1570K
387/1570K
388/1570K
389/1570K
391/1570K
392/1570K
394/1570K
395/1570K
397/1570K
398/1570K
399/1570K
401/1570K
402/1570K
404/1570K
405/1570K
406/1570K
408/1570K
409/1570K
411/1570K
412/1570K
414/1570K
418/1570K
422/1570K
426/1570K
426/1570K
428/1570K
429/1570K
430/1570K
432/1570K
433/1570K
435/1570K
436/1570K
438/1570K
439/1570K
440/1570K
442/1570K
443/1570K
445/1570K
446/1570K
447/1570K
449/1570K
450/1570K
452/1570K
453/1570K
455/1570K
456/1570K
457/1570K
459/1570K
460/1570K
462/1570K
463/1570K
464/1570K
466/1570K
467/1570K
469/1570K
470/1570K
471/1570K
473/1570K
474/1570K
476/1570K
477/1570K
481/1570K
485/1570K
486/1570K
490/1570K
490/1570K
491/1570K
495/1570K
499/1570K
500/1570K
501/1570K
503/1570K
504/1570K
505/1570K
507/1570K
508/1570K
510/1570K
511/1570K
512/1570K
514/1570K
515/1570K
517/1570K
518/1570K
520/1570K
521/1570K
522/1570K
524/1570K
525/1570K
527/1570K
528/1570K
529/1570K
531/1570K
532/1570K
534/1570K
535/1570K
537/1570K
538/1570K
539/1570K
541/1570K
542/1570K
544/1570K
545/1570K
546/1570K
548/1570K
549/1570K
551/1570K
552/1570K
554/1570K
555/1570K
556/1570K
560/1570K
564/1570K
565/1570K
569/1570K
569/1570K
570/1570K
572/1570K
573/1570K
575/1570K
576/1570K
578/1570K
579/1570K
580/1570K
582/1570K
583/1570K
587/1570K
591/1570K
593/1570K
595/1570K
596/1570K
597/1570K
599/1570K
600/1570K
602/1570K
603/1570K
604/1570K
606/1570K
607/1570K
609/1570K
610/1570K
611/1570K
613/1570K
614/1570K
616/1570K
617/1570K
619/1570K
620/1570K
621/1570K
625/1570K
626/1570K
627/1570K
628/1570K
630/1570K
631/1570K
633/1570K
634/1570K
636/1570K
637/1570K
638/1570K
640/1570K
641/1570K
643/1570K
644/1570K
645/1570K
647/1570K
648/1570K
650/1570K
654/1570K
658/1570K
658/1570K
662/1570K
662/1570K
664/1570K
665/1570K
667/1570K
668/1570K
669/1570K
671/1570K
672/1570K
674/1570K
675/1570K
677/1570K
681/1570K
685/1570K
688/1570K
689/1570K
691/1570K
692/1570K
693/1570K
695/1570K
696/1570K
698/1570K
699/1570K
701/1570K
702/1570K
703/1570K
705/1570K
706/1570K
708/1570K
709/1570K
710/1570K
712/1570K
713/1570K
715/1570K
716/1570K
718/1570K
719/1570K
720/1570K
722/1570K
723/1570K
725/1570K
726/1570K
727/1570K
729/1570K
730/1570K
732/1570K
733/1570K
735/1570K
736/1570K
737/1570K
739/1570K
740/1570K
742/1570K
743/1570K
744/1570K
746/1570K
747/1570K
749/1570K
753/1570K
757/1570K
757/1570K
759/1570K
760/1570K
761/1570K
763/1570K
764/1570K
766/1570K
767/1570K
771/1570K
774/1570K
776/1570K
777/1570K
778/1570K
780/1570K
781/1570K
783/1570K
784/1570K
785/1570K
789/1570K
793/1570K
794/1570K
795/1570K
797/1570K
798/1570K
800/1570K
801/1570K
802/1570K
804/1570K
805/1570K
807/1570K
808/1570K
809/1570K
811/1570K
812/1570K
814/1570K
815/1570K
817/1570K
818/1570K
819/1570K
821/1570K
822/1570K
824/1570K
825/1570K
826/1570K
828/1570K
829/1570K
831/1570K
832/1570K
833/1570K
835/1570K
836/1570K
838/1570K
839/1570K
841/1570K
842/1570K
843/1570K
845/1570K
846/1570K
848/1570K
849/1570K
850/1570K
854/1570K
858/1570K
859/1570K
860/1570K
862/1570K
863/1570K
865/1570K
866/1570K
867/1570K
869/1570K
870/1570K
872/1570K
873/1570K
874/1570K
876/1570K
877/1570K
879/1570K
880/1570K
882/1570K
883/1570K
884/1570K
886/1570K
887/1570K
889/1570K
890/1570K
891/1570K
893/1570K
894/1570K
896/1570K
897/1570K
898/1570K
900/1570K
901/1570K
902/1570K
904/1570K
908/1570K
912/1570K
912/1570K
916/1570K
916/1570K
918/1570K
919/1570K
920/1570K
922/1570K
923/1570K
925/1570K
926/1570K
928/1570K
929/1570K
930/1570K
932/1570K
933/1570K
935/1570K
936/1570K
937/1570K
939/1570K
940/1570K
942/1570K
943/1570K
945/1570K
946/1570K
947/1570K
949/1570K
950/1570K
952/1570K
953/1570K
954/1570K
956/1570K
957/1570K
959/1570K
960/1570K
961/1570K
963/1570K
964/1570K
966/1570K
967/1570K
971/1570K
975/1570K
977/1570K
978/1570K
980/1570K
981/1570K
983/1570K
984/1570K
986/1570K
990/1570K
994/1570K
995/1570K
997/1570K
998/1570K
1000/1570K
1001/1570K
1002/1570K
1004/1570K
1005/1570K
1007/1570K
1008/1570K
1010/1570K
1011/1570K
1012/1570K
1014/1570K
1015/1570K
1017/1570K
1018/1570K
1019/1570K
1021/1570K
1022/1570K
1024/1570K
1025/1570K
1027/1570K
1028/1570K
1029/1570K
1031/1570K
1032/1570K
1034/1570K
1035/1570K
1036/1570K
1038/1570K
1039/1570K
1041/1570K
1042/1570K
1043/1570K
1045/1570K
1046/1570K
1048/1570K
1049/1570K
1053/1570K
1056/1570K
1060/1570K
1060/1570K
1062/1570K
1063/1570K
1065/1570K
1066/1570K
1068/1570K
1069/1570K
1070/1570K
1072/1570K
1073/1570K
1075/1570K
1079/1570K
1082/1570K
1083/1570K
1085/1570K
1086/1570K
1087/1570K
1089/1570K
1090/1570K
1092/1570K
1093/1570K
1094/1570K
1096/1570K
1097/1570K
1099/1570K
1100/1570K
1101/1570K
1103/1570K
1104/1570K
1106/1570K
1107/1570K
1109/1570K
1110/1570K
1111/1570K
1113/1570K
1114/1570K
1116/1570K
1117/1570K
1118/1570K
1120/1570K
1121/1570K
1123/1570K
1124/1570K
1126/1570K
1127/1570K
1128/1570K
1130/1570K
1131/1570K
1133/1570K
1137/1570K
1138/1570K
1140/1570K
1141/1570K
1142/1570K
1144/1570K
1145/1570K
1147/1570K
1148/1570K
1150/1570K
1151/1570K
1152/1570K
1154/1570K
1155/1570K
1157/1570K
1158/1570K
1159/1570K
1161/1570K
1162/1570K
1164/1570K
1168/1570K
1172/1570K
1172/1570K
1174/1570K
1175/1570K
1176/1570K
1178/1570K
1179/1570K
1181/1570K
1185/1570K
1189/1570K
1189/1570K
1191/1570K
1192/1570K
1193/1570K
1195/1570K
1196/1570K
1198/1570K
1199/1570K
1200/1570K
1202/1570K
1203/1570K
1205/1570K
1206/1570K
1209/1570K
1210/1570K
1212/1570K
1213/1570K
1216/1570K
1217/1570K
1219/1570K
1220/1570K
1222/1570K
1223/1570K
1224/1570K
1226/1570K
1227/1570K
1229/1570K
1230/1570K
1232/1570K
1233/1570K
1234/1570K
1236/1570K
1240/1570K
1244/1570K
1248/1570K
1249/1570K
1250/1570K
1251/1570K
1253/1570K
1254/1570K
1256/1570K
1257/1570K
1258/1570K
1260/1570K
1261/1570K
1263/1570K
1264/1570K
1266/1570K
1267/1570K
1268/1570K
1270/1570K
1271/1570K
1273/1570K
1274/1570K
1275/1570K
1277/1570K
1278/1570K
1280/1570K
1281/1570K
1282/1570K
1284/1570K
1285/1570K
1287/1570K
1288/1570K
1290/1570K
1291/1570K
1292/1570K
1294/1570K
1295/1570K
1297/1570K
1298/1570K
1299/1570K
1303/1570K
1307/1570K
1308/1570K
1312/1570K
1312/1570K
1314/1570K
1315/1570K
1316/1570K
1318/1570K
1319/1570K
1321/1570K
1322/1570K
1323/1570K
1325/1570K
1326/1570K
1328/1570K
1329/1570K
1331/1570K
1332/1570K
1333/1570K
1335/1570K
1336/1570K
1339/1570K
1340/1570K
1342/1570K
1343/1570K
1345/1570K
1346/1570K
1348/1570K
1349/1570K
1353/1570K
1355/1570K
1359/1570K
1359/1570K
1360/1570K
1362/1570K
1363/1570K
1364/1570K
1368/1570K
1369/1570K
1370/1570K
1372/1570K
1373/1570K
1374/1570K
1376/1570K
1377/1570K
1379/1570K
1380/1570K
1381/1570K
1383/1570K
1384/1570K
1386/1570K
1387/1570K
1391/1570K
1395/1570K
1397/1570K
1398/1570K
1400/1570K
1401/1570K
1403/1570K
1404/1570K
1405/1570K
1407/1570K
1408/1570K
1410/1570K
1411/1570K
1413/1570K
1414/1570K
1415/1570K
1417/1570K
1418/1570K
1420/1570K
1421/1570K
1425/1570K
1429/1570K
1431/1570K
1432/1570K
1434/1570K
1435/1570K
1437/1570K
1439/1570K
1441/1570K
1442/1570K
1444/1570K
1445/1570K
1447/1570K
1448/1570K
1449/1570K
1451/1570K
1452/1570K
1454/1570K
1455/1570K
1459/1570K
1463/1570K
1463/1570K
1465/1570K
1466/1570K
1468/1570K
1469/1570K
1471/1570K
1472/1570K
1473/1570K
1475/1570K
1476/1570K
1478/1570K
1479/1570K
1480/1570K
1482/1570K
1483/1570K
1485/1570K
1486/1570K
1488/1570K
1489/1570K
1490/1570K
1492/1570K
1493/1570K
1495/1570K
1496/1570K
1497/1570K
1499/1570K
1500/1570K
1502/1570K
1503/1570K
1504/1570K
1506/1570K
1507/1570K
1509/1570K
1510/1570K
1512/1570K
1513/1570K
1514/1570K
1517/1570K
1519/1570K
1520/1570K
1521/1570K
1523/1570K
1524/1570K
1526/1570K
1527/1570K
1529/1570K
1530/1570K
1531/1570K
1533/1570K
1534/1570K
1538/1570K
1542/1570K
1543/1570K
1547/1570K
1548/1570K
1550/1570K
1551/1570K
1553/1570K
1554/1570K
1555/1570K
1557/1570K
1558/1570K
1560/1570K
1561/1570K
1562/1570K
1564/1570K
1565/1570K
1567/1570K
1568/1570K
1570/1570K
1570K downloaded
build:start:

multiproject:install-callback:
    [echo] Running jar:install for Geronimo :: Axis
java:prepare-filesystem:

java:compile:
<depend closure="false" srcdir="1.4" dump="false" destdir="/home/continuum/build/work/1/modules/axis/target/classes"></depend>
   [echo] Compiling to /home/continuum/build/work/1/modules/axis/target/classes
Running post goal: java:compile
geronimo:dependency:


java:jar-resources:
Copying 1 file to /home/continuum/build/work/1/modules/axis/target/classes

test:prepare-filesystem:

test:test-resources:

test:compile:

test:test:
    [echo] NOTICE: Skipping tests; they seem to have passed already
    [echo] No tests to run.
Running post goal: test:test

jar:jar:
    [jar] Building jar: /home/continuum/build/work/1/modules/axis/target/geronimo-axis-1.0-SNAPSHOT.jar

jar:install:
    [echo] Installing...
Uploading to geronimo/jars/geronimo-axis-1.0-SNAPSHOT.jar: 
.................... (39K)
Uploading to geronimo/poms/geronimo-axis-1.0-SNAPSHOT.pom: 
.................... (12K)

+----------------------------------------
| geronimo and geronimo-plugins Geronimo :: Naming
| Memory: 10M/17M
+----------------------------------------
DEPRECATED: the default goal should be specified in the <build> section of project.xml
instead of maven.xml
DEPRECATED: the default goal should be specified in the <build> section of project.xml
instead of maven.xml

build:end:

build:start:

multiproject:install-callback:
    [echo] Running jar:install for Geronimo :: Naming
java:prepare-filesystem:

java:compile:
<depend closure="false" srcdir="1.4" dump="false" destdir="/home/continuum/build/work/1/modules/naming/target/classes"></depend>
   [echo] Compiling to /home/continuum/build/work/1/modules/naming/target/classes

java:jar-resources:

test:prepare-filesystem:

test:test-resources:

test:compile:

test:test:
    [echo] NOTICE: Skipping tests; they seem to have passed already
    [echo] No tests to run.
Running post goal: test:test

jar:jar:

jar:install:
    [echo] Installing...
Uploading to geronimo/jars/geronimo-naming-1.0-SNAPSHOT.jar: 
.................... (45K)
Uploading to geronimo/poms/geronimo-naming-1.0-SNAPSHOT.pom: 
.................... (9K)

+----------------------------------------
| geronimo and geronimo-plugins Geronimo :: Deploy :: Common Config
| Memory: 11M/17M
+----------------------------------------
DEPRECATED: the default goal should be specified in the <build> section of project.xml
instead of maven.xml
DEPRECATED: the default goal should be specified in the <build> section of project.xml
instead of maven.xml

build:end:

build:start:

multiproject:install-callback:
    [echo] Running jar:install for Geronimo :: Deploy :: Common Config
java:prepare-filesystem:

java:compile:
<depend closure="false" srcdir="1.4" dump="false" destdir="/home/continuum/build/work/1/modules/deploy-config/target/classes"></depend>
   [echo] Compiling to /home/continuum/build/work/1/modules/deploy-config/target/classes

java:jar-resources:

test:prepare-filesystem:

test:test-resources:

test:compile:

test:test:
    [echo] NOTICE: Skipping tests; they seem to have passed already
    [echo] No tests to run.
Running post goal: test:test

jar:jar:

jar:install:
    [echo] Installing...
Uploading to geronimo/jars/geronimo-deploy-config-1.0-SNAPSHOT.jar: 
.................... (10K)
Uploading to geronimo/poms/geronimo-deploy-config-1.0-SNAPSHOT.pom: 
.................... (10K)

+----------------------------------------
| geronimo and geronimo-plugins Geronimo :: Test :: DDBeans
| Memory: 11M/17M
+----------------------------------------
DEPRECATED: the default goal should be specified in the <build> section of project.xml
instead of maven.xml
DEPRECATED: the default goal should be specified in the <build> section of project.xml
instead of maven.xml

build:end:

build:start:

multiproject:install-callback:
    [echo] Running jar:install for Geronimo :: Test :: DDBeans
java:prepare-filesystem:

java:compile:
<depend closure="false" srcdir="1.4" dump="false" destdir="/home/continuum/build/work/1/modules/test-ddbean/target/classes"></depend>
   [echo] Compiling to /home/continuum/build/work/1/modules/test-ddbean/target/classes

java:jar-resources:

test:prepare-filesystem:

test:test-resources:

test:compile:

test:test:
    [echo] NOTICE: Skipping tests; they seem to have passed already
    [echo] No tests to run.
Running post goal: test:test

jar:jar:

jar:install:
    [echo] Installing...
Uploading to geronimo/jars/geronimo-test-ddbean-1.0-SNAPSHOT.jar: 
.................... (17K)
Uploading to geronimo/poms/geronimo-test-ddbean-1.0-SNAPSHOT.pom: 
.................... (10K)

+----------------------------------------
| geronimo and geronimo-plugins Geronimo :: Transaction
| Memory: 11M/17M
+----------------------------------------
DEPRECATED: the default goal should be specified in the <build> section of project.xml
instead of maven.xml

build:end:

build:start:

multiproject:install-callback:
    [echo] Running jar:install for Geronimo :: Transaction
java:prepare-filesystem:

java:compile:
<depend closure="false" srcdir="1.4" dump="false" destdir="/home/continuum/build/work/1/modules/transaction/target/classes"></depend>
   [echo] Compiling to /home/continuum/build/work/1/modules/transaction/target/classes

java:jar-resources:

test:prepare-filesystem:

test:test-resources:

test:compile:

test:test:
    [echo] NOTICE: Skipping tests; they seem to have passed already
    [echo] No tests to run.
Running post goal: test:test

jar:jar:

jar:install:
    [echo] Installing...
Uploading to geronimo/jars/geronimo-transaction-1.0-SNAPSHOT.jar: 
.................... (73K)
Uploading to geronimo/poms/geronimo-transaction-1.0-SNAPSHOT.pom: 
.................... (11K)

+----------------------------------------
| geronimo and geronimo-plugins Geronimo :: Connector
| Memory: 12M/17M
+----------------------------------------
DEPRECATED: the default goal should be specified in the <build> section of project.xml
instead of maven.xml
DEPRECATED: the default goal should be specified in the <build> section of project.xml
instead of maven.xml

build:end:

Attempting to download geronimo-naming-1.0-SNAPSHOT.jar.
Attempting to download geronimo-transaction-1.0-SNAPSHOT.jar.
build:start:

multiproject:install-callback:
    [echo] Running jar:install for Geronimo :: Connector
java:prepare-filesystem:

java:compile:
<depend closure="false" srcdir="1.4" dump="false" destdir="/home/continuum/build/work/1/modules/connector/target/classes"></depend>
   [echo] Compiling to /home/continuum/build/work/1/modules/connector/target/classes

java:jar-resources:

test:prepare-filesystem:

test:test-resources:

test:compile:

test:test:
    [echo] NOTICE: Skipping tests; they seem to have passed already
    [echo] No tests to run.
Running post goal: test:test

jar:jar:

jar:install:
    [echo] Installing...
Uploading to geronimo/jars/geronimo-connector-1.0-SNAPSHOT.jar: 
.................... (128K)
Uploading to geronimo/poms/geronimo-connector-1.0-SNAPSHOT.pom: 
.................... (12K)

+----------------------------------------
| geronimo and geronimo-plugins Geronimo :: Security :: Builder
| Memory: 14M/17M
+----------------------------------------
DEPRECATED: the default goal should be specified in the <build> section of project.xml
instead of maven.xml
DEPRECATED: the default goal should be specified in the <build> section of project.xml
instead of maven.xml

build:end:

Attempting to download geronimo-deploy-config-1.0-SNAPSHOT.jar.
build:start:

multiproject:install-callback:
    [echo] Running jar:install for Geronimo :: Security :: Builder
java:prepare-filesystem:

java:compile:
<depend closure="false" srcdir="1.4" dump="false" destdir="/home/continuum/build/work/1/modules/security-builder/target/classes"></depend>
   [echo] Compiling to /home/continuum/build/work/1/modules/security-builder/target/classes

java:jar-resources:

test:prepare-filesystem:

test:test-resources:
Running post goal: test:test-resources
    [delete] Deleting directory /home/continuum/build/work/1/modules/security-builder/target/database
    [mkdir] Created dir: /home/continuum/build/work/1/modules/security-builder/target/database

test:compile:
    [echo] No test source files to compile.

test:test:
    [echo] NOTICE: Skipping tests; they seem to have passed already
    [echo] No tests to run.
Running post goal: test:test

jar:jar:

jar:install:
    [echo] Installing...
Uploading to geronimo/jars/geronimo-security-builder-1.0-SNAPSHOT.jar: 
.................... (173K)
Uploading to geronimo/poms/geronimo-security-builder-1.0-SNAPSHOT.pom: 
.................... (11K)

+----------------------------------------
| geronimo and geronimo-plugins Geronimo :: J2EE
| Memory: 16M/17M
+----------------------------------------
DEPRECATED: the default goal should be specified in the <build> section of project.xml
instead of maven.xml
DEPRECATED: the default goal should be specified in the <build> section of project.xml
instead of maven.xml

build:end:

Attempting to download geronimo-security-builder-1.0-SNAPSHOT.jar.
build:start:

multiproject:install-callback:
    [echo] Running jar:install for Geronimo :: J2EE
java:prepare-filesystem:

java:compile:
<depend closure="false" srcdir="1.4" dump="false" destdir="/home/continuum/build/work/1/modules/j2ee-builder/target/classes"></depend>
   [echo] Compiling to /home/continuum/build/work/1/modules/j2ee-builder/target/classes

java:jar-resources:

test:prepare-filesystem:

test:test-resources:

test:compile:
setupEar:

setupEar:

setupUnpackedEar:
setupBaseUnpackedEar:

setupBaseUnpackedEar:

setupBaseUnpackedEar:



test:test:
    [echo] NOTICE: Skipping tests; they seem to have passed already
    [echo] No tests to run.
Running post goal: test:test

jar:jar:

jar:install:
    [echo] Installing...
Uploading to geronimo/jars/geronimo-j2ee-builder-1.0-SNAPSHOT.jar: 
.................... (94K)
Uploading to geronimo/poms/geronimo-j2ee-builder-1.0-SNAPSHOT.pom: 
.................... (12K)

+----------------------------------------
| geronimo and geronimo-plugins Geronimo :: Naming :: Builder
| Memory: 11M/19M
+----------------------------------------
DEPRECATED: the default goal should be specified in the <build> section of project.xml
instead of maven.xml
DEPRECATED: the default goal should be specified in the <build> section of project.xml
instead of maven.xml

build:end:

Attempting to download geronimo-j2ee-builder-1.0-SNAPSHOT.jar.
build:start:

multiproject:install-callback:
    [echo] Running jar:install for Geronimo :: Naming :: Builder
java:prepare-filesystem:

java:compile:
<depend closure="false" srcdir="1.4" dump="false" destdir="/home/continuum/build/work/1/modules/naming-builder/target/classes"></depend>
   [echo] Compiling to /home/continuum/build/work/1/modules/naming-builder/target/classes

java:jar-resources:

test:prepare-filesystem:

test:test-resources:

test:compile:

test:test:
    [echo] NOTICE: Skipping tests; they seem to have passed already
    [echo] No tests to run.
Running post goal: test:test

jar:jar:

jar:install:
    [echo] Installing...
Uploading to geronimo/jars/geronimo-naming-builder-1.0-SNAPSHOT.jar: 
.................... (174K)
Uploading to geronimo/poms/geronimo-naming-builder-1.0-SNAPSHOT.pom: 
.................... (12K)

+----------------------------------------
| geronimo and geronimo-plugins Geronimo :: Connector :: Builder
| Memory: 12M/19M
+----------------------------------------
DEPRECATED: the default goal should be specified in the <build> section of project.xml
instead of maven.xml
DEPRECATED: the default goal should be specified in the <build> section of project.xml
instead of maven.xml

build:end:

Attempting to download geronimo-test-ddbean-1.0-SNAPSHOT.jar.
Attempting to download geronimo-connector-1.0-SNAPSHOT.jar.
Attempting to download geronimo-naming-builder-1.0-SNAPSHOT.jar.
build:start:

multiproject:install-callback:
    [echo] Running jar:install for Geronimo :: Connector :: Builder
java:prepare-filesystem:

java:compile:
<depend closure="false" srcdir="1.4" dump="false" destdir="/home/continuum/build/work/1/modules/connector-builder/target/classes"></depend>
   [echo] Compiling to /home/continuum/build/work/1/modules/connector-builder/target/classes

java:jar-resources:

test:prepare-filesystem:

test:test-resources:

test:compile:

test:test:
    [junit] Running org.apache.geronimo.connector.deployment.ConnectorModuleBuilderTest
    [junit] Tests run: 8, Failures: 0, Errors: 6, Time elapsed: 4.897 sec
    [junit] [ERROR] Test org.apache.geronimo.connector.deployment.ConnectorModuleBuilderTest
FAILED
    [junit] Running org.apache.geronimo.connector.deployment.PlanParsingTest
    [junit] Tests run: 7, Failures: 0, Errors: 0, Time elapsed: 1.263 sec
    [junit] Running org.apache.geronimo.connector.deployment.RAR_1_0DConfigBeanTest
    [junit] Tests run: 1, Failures: 0, Errors: 0, Time elapsed: 0.344 sec
    [junit] Running org.apache.geronimo.connector.deployment.RAR_1_5DConfigBeanTest
    [junit] Tests run: 1, Failures: 0, Errors: 0, Time elapsed: 0.343 sec
    [junit] Running org.apache.geronimo.connector.deployment.jsr88.Connector15DCBTest
    [junit] Tests run: 1, Failures: 0, Errors: 0, Time elapsed: 1.217 sec

BUILD FAILED
File...... /home/continuum/build/work/1/maven.xml
Element... maven:reactor
Line...... 43
Column.... -1
Unable to obtain goal [multiproject:install-callback] -- /home/continuum/.maven/cache/maven-test-plugin-1.7/plugin.jelly:183:-1:
<fail> There were test failures.
Total time   : 1 minutes 27 seconds 
Finished at  : Saturday, December 17, 2005 8:01:42 AM PST


****************************************************************************



Mime
View raw message