geronimo-scm mailing list archives

Site index · List index
Message view « Date » · « Thread »
Top « Date » · « Thread »
From continuum <contin...@stan.gbuild.org>
Subject [continuum] BUILD FAILURE: Geronimo:: Assemblies
Date Sat, 17 Dec 2005 22:29:55 GMT
Online report : http://ci.gbuild.org/continuum/target/ProjectBuild.vm/view/ProjectBuild/id/4/buildId/527
Build statistics:
  State: Failed
  Previous State: Failed
  Started at: Sat, 17 Dec 2005 14:28:22 -0800
  Finished at: Sat, 17 Dec 2005 14:29:53 -0800
  Total time: 1m 31s
  Build Trigger: Forced
  Exit code: 70
  Building machine hostname: stan.gbuild.org
  Operating system : Linux(unknown)
  Java version : 1.4.2_08(Sun Microsystems Inc.)

Changes
      No files changed
  
****************************************************************************
Output:
****************************************************************************
 __  __
|  \/  |__ _Apache__ ___
| |\/| / _` \ V / -_) ' \  ~ intelligent projects ~
|_|  |_\__,_|\_/\___|_||_|  v. 1.1-beta-2

build:start:

multiproject:clean:
multiproject:projects-init:
    [echo] Gathering project list
Starting the reactor...
Our processing order:
Geronimo Assembly for an IZPack Installer
Geronimo Assembly for a J2EE Server running Jetty
Geronimo Assembly for a J2EE Server running Tomcat
+----------------------------------------
| Gathering project list Geronimo Assembly for an IZPack Installer
| Memory: 11M/16M
+----------------------------------------
+----------------------------------------
| Gathering project list Geronimo Assembly for a J2EE Server running Jetty
| Memory: 11M/16M
+----------------------------------------
+----------------------------------------
| Gathering project list Geronimo Assembly for a J2EE Server running Tomcat
| Memory: 11M/16M
+----------------------------------------

multiproject:goal:
Starting the reactor...
Our processing order:
Geronimo Assembly for an IZPack Installer
Geronimo Assembly for a J2EE Server running Jetty
Geronimo Assembly for a J2EE Server running Tomcat
+----------------------------------------
| Executing clean:clean Geronimo Assembly for an IZPack Installer
| Memory: 11M/16M
+----------------------------------------
DEPRECATED: the default goal should be specified in the <build> section of project.xml
instead of maven.xml
DEPRECATED: the default goal should be specified in the <build> section of project.xml
instead of maven.xml
Attempting to download geronimo-izpack-plugin-1.0-SNAPSHOT.jar.
Attempting to download j2ee-system-1.0-SNAPSHOT.car.
Attempting to download rmi-naming-1.0-SNAPSHOT.car.
Attempting to download j2ee-server-1.0-SNAPSHOT.car.
Attempting to download j2ee-security-1.0-SNAPSHOT.car.
Attempting to download j2ee-corba-1.0-SNAPSHOT.car.
Attempting to download jetty-1.0-SNAPSHOT.car.
Attempting to download tomcat-1.0-SNAPSHOT.car.
Attempting to download directory-1.0-SNAPSHOT.car.
Attempting to download system-database-1.0-SNAPSHOT.car.
Attempting to download activemq-broker-1.0-SNAPSHOT.car.
Attempting to download activemq-1.0-SNAPSHOT.car.
Attempting to download geronimo-gbean-deployer-1.0-SNAPSHOT.car.
Attempting to download hot-deployer-1.0-SNAPSHOT.car.
Attempting to download j2ee-deployer-1.0-SNAPSHOT.car.
Attempting to download jetty-deployer-1.0-SNAPSHOT.car.
Attempting to download welcome-jetty-1.0-SNAPSHOT.car.
Attempting to download servlets-examples-jetty-1.0-SNAPSHOT.car.
Attempting to download jsp-examples-jetty-1.0-SNAPSHOT.car.
Attempting to download webconsole-jetty-1.0-SNAPSHOT.car.
Attempting to download remote-deploy-jetty-1.0-SNAPSHOT.car.
Attempting to download jmxdebug-jetty-1.0-SNAPSHOT.car.
Attempting to download uddi-jetty-1.0-SNAPSHOT.car.
Attempting to download tomcat-deployer-1.0-SNAPSHOT.car.
Attempting to download welcome-tomcat-1.0-SNAPSHOT.car.
Attempting to download webconsole-tomcat-1.0-SNAPSHOT.car.
Attempting to download remote-deploy-tomcat-1.0-SNAPSHOT.car.
Attempting to download jmxdebug-tomcat-1.0-SNAPSHOT.car.
Attempting to download uddi-tomcat-1.0-SNAPSHOT.car.
Attempting to download client-system-1.0-SNAPSHOT.car.
Attempting to download client-1.0-SNAPSHOT.car.
Attempting to download client-security-1.0-SNAPSHOT.car.
Attempting to download client-corba-1.0-SNAPSHOT.car.
Attempting to download geronimo-scripts-1.0-SNAPSHOT.jar.
Attempting to download geronimo-common-1.0-SNAPSHOT.jar.
Attempting to download geronimo-deploy-tool-1.0-SNAPSHOT.jar.
Attempting to download geronimo-deployment-1.0-SNAPSHOT.jar.
Attempting to download geronimo-kernel-1.0-SNAPSHOT.jar.
Attempting to download geronimo-system-1.0-SNAPSHOT.jar.
Attempting to download online-deployer-1.0-SNAPSHOT.car.
Attempting to download geronimo-deploy-jsr88-1.0-SNAPSHOT.jar.
Attempting to download geronimo-util-1.0-SNAPSHOT.jar.
Attempting to download shutdown-1.0-SNAPSHOT.car.
Attempting to download axis-1.4-SNAPSHOT.jar.
2/1570K
3/1570K
5/1570K
6/1570K
8/1570K
9/1570K
11/1570K
12/1570K
13/1570K
15/1570K
16/1570K
18/1570K
19/1570K
20/1570K
22/1570K
23/1570K
25/1570K
26/1570K
29/1570K
30/1570K
32/1570K
36/1570K
37/1570K
39/1570K
40/1570K
42/1570K
43/1570K
44/1570K
46/1570K
47/1570K
49/1570K
50/1570K
52/1570K
53/1570K
54/1570K
56/1570K
57/1570K
59/1570K
60/1570K
61/1570K
63/1570K
64/1570K
66/1570K
67/1570K
68/1570K
70/1570K
71/1570K
73/1570K
74/1570K
76/1570K
77/1570K
78/1570K
80/1570K
81/1570K
83/1570K
84/1570K
85/1570K
87/1570K
88/1570K
90/1570K
91/1570K
93/1570K
94/1570K
95/1570K
97/1570K
98/1570K
100/1570K
101/1570K
102/1570K
104/1570K
105/1570K
107/1570K
108/1570K
109/1570K
111/1570K
112/1570K
114/1570K
115/1570K
117/1570K
118/1570K
119/1570K
121/1570K
122/1570K
124/1570K
125/1570K
129/1570K
133/1570K
135/1570K
136/1570K
139/1570K
141/1570K
142/1570K
143/1570K
145/1570K
146/1570K
148/1570K
149/1570K
150/1570K
152/1570K
153/1570K
155/1570K
156/1570K
158/1570K
159/1570K
160/1570K
162/1570K
163/1570K
165/1570K
166/1570K
167/1570K
169/1570K
173/1570K
177/1570K
181/1570K
182/1570K
183/1570K
184/1570K
186/1570K
187/1570K
189/1570K
190/1570K
192/1570K
193/1570K
194/1570K
196/1570K
197/1570K
199/1570K
200/1570K
201/1570K
203/1570K
204/1570K
206/1570K
207/1570K
208/1570K
210/1570K
211/1570K
213/1570K
214/1570K
216/1570K
217/1570K
218/1570K
220/1570K
221/1570K
223/1570K
224/1570K
225/1570K
227/1570K
228/1570K
230/1570K
231/1570K
233/1570K
237/1570K
241/1570K
241/1570K
245/1570K
245/1570K
247/1570K
248/1570K
249/1570K
251/1570K
252/1570K
254/1570K
255/1570K
257/1570K
258/1570K
259/1570K
263/1570K
266/1570K
268/1570K
269/1570K
271/1570K
272/1570K
274/1570K
275/1570K
276/1570K
278/1570K
279/1570K
281/1570K
282/1570K
283/1570K
285/1570K
286/1570K
290/1570K
294/1570K
296/1570K
298/1570K
299/1570K
300/1570K
302/1570K
303/1570K
305/1570K
306/1570K
307/1570K
309/1570K
310/1570K
312/1570K
313/1570K
315/1570K
316/1570K
317/1570K
319/1570K
320/1570K
322/1570K
323/1570K
324/1570K
326/1570K
327/1570K
329/1570K
330/1570K
331/1570K
333/1570K
334/1570K
336/1570K
337/1570K
339/1570K
340/1570K
341/1570K
343/1570K
344/1570K
346/1570K
347/1570K
348/1570K
350/1570K
351/1570K
353/1570K
357/1570K
361/1570K
361/1570K
365/1570K
365/1570K
367/1570K
368/1570K
370/1570K
371/1570K
373/1570K
374/1570K
375/1570K
377/1570K
378/1570K
380/1570K
381/1570K
382/1570K
384/1570K
385/1570K
387/1570K
388/1570K
389/1570K
391/1570K
392/1570K
394/1570K
395/1570K
397/1570K
398/1570K
399/1570K
401/1570K
402/1570K
404/1570K
405/1570K
406/1570K
408/1570K
409/1570K
411/1570K
412/1570K
414/1570K
415/1570K
416/1570K
418/1570K
419/1570K
421/1570K
422/1570K
423/1570K
425/1570K
426/1570K
428/1570K
429/1570K
430/1570K
432/1570K
433/1570K
435/1570K
436/1570K
438/1570K
439/1570K
440/1570K
442/1570K
443/1570K
445/1570K
446/1570K
447/1570K
449/1570K
450/1570K
452/1570K
453/1570K
455/1570K
456/1570K
457/1570K
459/1570K
460/1570K
462/1570K
463/1570K
467/1570K
471/1570K
475/1570K
476/1570K
477/1570K
479/1570K
480/1570K
481/1570K
483/1570K
484/1570K
486/1570K
487/1570K
488/1570K
490/1570K
491/1570K
493/1570K
494/1570K
496/1570K
497/1570K
498/1570K
500/1570K
501/1570K
503/1570K
504/1570K
505/1570K
507/1570K
508/1570K
510/1570K
511/1570K
512/1570K
514/1570K
518/1570K
522/1570K
522/1570K
526/1570K
527/1570K
528/1570K
529/1570K
531/1570K
532/1570K
534/1570K
535/1570K
537/1570K
538/1570K
539/1570K
541/1570K
542/1570K
544/1570K
545/1570K
546/1570K
548/1570K
549/1570K
551/1570K
555/1570K
559/1570K
562/1570K
563/1570K
565/1570K
566/1570K
568/1570K
569/1570K
570/1570K
572/1570K
573/1570K
575/1570K
576/1570K
578/1570K
582/1570K
586/1570K
590/1570K
590/1570K
592/1570K
593/1570K
595/1570K
596/1570K
597/1570K
599/1570K
600/1570K
602/1570K
603/1570K
607/1570K
611/1570K
613/1570K
614/1570K
616/1570K
617/1570K
619/1570K
620/1570K
621/1570K
623/1570K
624/1570K
626/1570K
627/1570K
628/1570K
630/1570K
631/1570K
633/1570K
634/1570K
636/1570K
637/1570K
638/1570K
640/1570K
641/1570K
643/1570K
644/1570K
645/1570K
647/1570K
648/1570K
650/1570K
651/1570K
652/1570K
654/1570K
655/1570K
657/1570K
658/1570K
660/1570K
661/1570K
662/1570K
664/1570K
665/1570K
667/1570K
668/1570K
669/1570K
673/1570K
677/1570K
678/1570K
681/1570K
682/1570K
684/1570K
685/1570K
686/1570K
688/1570K
689/1570K
691/1570K
692/1570K
693/1570K
695/1570K
696/1570K
698/1570K
699/1570K
701/1570K
702/1570K
703/1570K
705/1570K
706/1570K
708/1570K
709/1570K
710/1570K
712/1570K
713/1570K
715/1570K
716/1570K
718/1570K
719/1570K
720/1570K
722/1570K
723/1570K
725/1570K
726/1570K
727/1570K
731/1570K
735/1570K
736/1570K
740/1570K
740/1570K
742/1570K
743/1570K
744/1570K
746/1570K
747/1570K
749/1570K
750/1570K
751/1570K
753/1570K
754/1570K
756/1570K
757/1570K
759/1570K
760/1570K
761/1570K
763/1570K
764/1570K
766/1570K
767/1570K
768/1570K
770/1570K
771/1570K
773/1570K
777/1570K
781/1570K
781/1570K
783/1570K
784/1570K
785/1570K
787/1570K
788/1570K
790/1570K
791/1570K
792/1570K
794/1570K
795/1570K
797/1570K
798/1570K
800/1570K
801/1570K
802/1570K
804/1570K
805/1570K
807/1570K
808/1570K
809/1570K
811/1570K
812/1570K
814/1570K
815/1570K
817/1570K
818/1570K
822/1570K
826/1570K
828/1570K
829/1570K
831/1570K
832/1570K
833/1570K
835/1570K
836/1570K
838/1570K
839/1570K
841/1570K
842/1570K
843/1570K
845/1570K
846/1570K
848/1570K
849/1570K
850/1570K
852/1570K
856/1570K
860/1570K
862/1570K
863/1570K
865/1570K
866/1570K
867/1570K
869/1570K
870/1570K
872/1570K
873/1570K
874/1570K
876/1570K
877/1570K
879/1570K
880/1570K
882/1570K
883/1570K
884/1570K
886/1570K
887/1570K
889/1570K
890/1570K
891/1570K
893/1570K
894/1570K
896/1570K
897/1570K
899/1570K
900/1570K
901/1570K
903/1570K
904/1570K
906/1570K
907/1570K
908/1570K
912/1570K
916/1570K
917/1570K
921/1570K
921/1570K
923/1570K
924/1570K
925/1570K
927/1570K
928/1570K
930/1570K
931/1570K
932/1570K
934/1570K
935/1570K
937/1570K
938/1570K
940/1570K
941/1570K
942/1570K
944/1570K
945/1570K
947/1570K
948/1570K
949/1570K
951/1570K
952/1570K
954/1570K
955/1570K
957/1570K
958/1570K
959/1570K
961/1570K
962/1570K
964/1570K
965/1570K
966/1570K
970/1570K
972/1570K
973/1570K
975/1570K
976/1570K
978/1570K
979/1570K
981/1570K
982/1570K
983/1570K
985/1570K
986/1570K
988/1570K
989/1570K
990/1570K
992/1570K
993/1570K
995/1570K
999/1570K
1003/1570K
1006/1570K
1007/1570K
1009/1570K
1010/1570K
1012/1570K
1013/1570K
1014/1570K
1016/1570K
1017/1570K
1019/1570K
1020/1570K
1023/1570K
1027/1570K
1031/1570K
1033/1570K
1034/1570K
1036/1570K
1037/1570K
1039/1570K
1040/1570K
1041/1570K
1043/1570K
1044/1570K
1046/1570K
1047/1570K
1048/1570K
1050/1570K
1051/1570K
1053/1570K
1054/1570K
1055/1570K
1057/1570K
1058/1570K
1060/1570K
1061/1570K
1063/1570K
1064/1570K
1065/1570K
1069/1570K
1073/1570K
1075/1570K
1077/1570K
1078/1570K
1080/1570K
1081/1570K
1082/1570K
1084/1570K
1085/1570K
1087/1570K
1088/1570K
1089/1570K
1091/1570K
1092/1570K
1094/1570K
1095/1570K
1097/1570K
1098/1570K
1099/1570K
1101/1570K
1102/1570K
1104/1570K
1105/1570K
1106/1570K
1108/1570K
1109/1570K
1111/1570K
1112/1570K
1113/1570K
1115/1570K
1116/1570K
1118/1570K
1119/1570K
1121/1570K
1122/1570K
1123/1570K
1125/1570K
1126/1570K
1130/1570K
1134/1570K
1135/1570K
1139/1570K
1139/1570K
1140/1570K
1142/1570K
1143/1570K
1145/1570K
1146/1570K
1147/1570K
1149/1570K
1150/1570K
1152/1570K
1153/1570K
1154/1570K
1156/1570K
1157/1570K
1159/1570K
1160/1570K
1162/1570K
1163/1570K
1164/1570K
1166/1570K
1167/1570K
1169/1570K
1170/1570K
1171/1570K
1173/1570K
1174/1570K
1176/1570K
1177/1570K
1179/1570K
1180/1570K
1181/1570K
1183/1570K
1184/1570K
1186/1570K
1187/1570K
1188/1570K
1190/1570K
1191/1570K
1193/1570K
1197/1570K
1198/1570K
1202/1570K
1206/1570K
1207/1570K
1211/1570K
1211/1570K
1212/1570K
1214/1570K
1215/1570K
1217/1570K
1218/1570K
1220/1570K
1221/1570K
1222/1570K
1224/1570K
1225/1570K
1227/1570K
1228/1570K
1229/1570K
1231/1570K
1232/1570K
1234/1570K
1235/1570K
1236/1570K
1238/1570K
1239/1570K
1241/1570K
1242/1570K
1244/1570K
1245/1570K
1246/1570K
1248/1570K
1249/1570K
1251/1570K
1252/1570K
1256/1570K
1260/1570K
1261/1570K
1262/1570K
1263/1570K
1265/1570K
1266/1570K
1268/1570K
1269/1570K
1270/1570K
1272/1570K
1273/1570K
1275/1570K
1276/1570K
1278/1570K
1279/1570K
1280/1570K
1282/1570K
1283/1570K
1285/1570K
1286/1570K
1287/1570K
1289/1570K
1290/1570K
1292/1570K
1293/1570K
1294/1570K
1296/1570K
1297/1570K
1299/1570K
1300/1570K
1302/1570K
1303/1570K
1304/1570K
1308/1570K
1310/1570K
1311/1570K
1313/1570K
1314/1570K
1316/1570K
1317/1570K
1319/1570K
1320/1570K
1321/1570K
1323/1570K
1324/1570K
1326/1570K
1327/1570K
1328/1570K
1330/1570K
1331/1570K
1333/1570K
1334/1570K
1335/1570K
1337/1570K
1338/1570K
1340/1570K
1341/1570K
1343/1570K
1344/1570K
1345/1570K
1347/1570K
1348/1570K
1352/1570K
1354/1570K
1355/1570K
1357/1570K
1358/1570K
1360/1570K
1361/1570K
1362/1570K
1364/1570K
1365/1570K
1367/1570K
1368/1570K
1369/1570K
1371/1570K
1372/1570K
1374/1570K
1375/1570K
1376/1570K
1378/1570K
1382/1570K
1386/1570K
1389/1570K
1391/1570K
1392/1570K
1393/1570K
1395/1570K
1396/1570K
1398/1570K
1399/1570K
1401/1570K
1405/1570K
1409/1570K
1410/1570K
1412/1570K
1413/1570K
1415/1570K
1416/1570K
1417/1570K
1419/1570K
1420/1570K
1422/1570K
1423/1570K
1425/1570K
1426/1570K
1427/1570K
1429/1570K
1430/1570K
1432/1570K
1433/1570K
1434/1570K
1436/1570K
1437/1570K
1439/1570K
1440/1570K
1442/1570K
1443/1570K
1444/1570K
1446/1570K
1447/1570K
1449/1570K
1450/1570K
1451/1570K
1453/1570K
1454/1570K
1456/1570K
1460/1570K
1464/1570K
1464/1570K
1468/1570K
1468/1570K
1470/1570K
1471/1570K
1473/1570K
1474/1570K
1475/1570K
1477/1570K
1478/1570K
1480/1570K
1481/1570K
1483/1570K
1484/1570K
1485/1570K
1487/1570K
1488/1570K
1490/1570K
1491/1570K
1492/1570K
1494/1570K
1495/1570K
1497/1570K
1498/1570K
1500/1570K
1501/1570K
1502/1570K
1504/1570K
1505/1570K
1507/1570K
1508/1570K
1509/1570K
1511/1570K
1512/1570K
1514/1570K
1515/1570K
1516/1570K
1518/1570K
1519/1570K
1523/1570K
1527/1570K
1528/1570K
1532/1570K
1532/1570K
1533/1570K
1535/1570K
1536/1570K
1538/1570K
1539/1570K
1541/1570K
1542/1570K
1543/1570K
1545/1570K
1546/1570K
1548/1570K
1549/1570K
1550/1570K
1552/1570K
1553/1570K
1555/1570K
1556/1570K
1557/1570K
1559/1570K
1560/1570K
1562/1570K
1563/1570K
1565/1570K
1566/1570K
1567/1570K
1569/1570K
1570/1570K
1570K downloaded
Attempting to download openejb-builder-2.0-SNAPSHOT.jar.
Attempting to download openejb-core-2.0-SNAPSHOT.jar.
Attempting to download openejb-pkgen-builder-2.0-SNAPSHOT.jar.
Attempting to download geronimo-console-core-1.0-SNAPSHOT.jar.
Attempting to download geronimo-activation-1.0-SNAPSHOT.jar.
Attempting to download geronimo-axis-1.0-SNAPSHOT.jar.
Attempting to download geronimo-axis-builder-1.0-SNAPSHOT.jar.
Attempting to download geronimo-client-1.0-SNAPSHOT.jar.
Attempting to download geronimo-client-builder-1.0-SNAPSHOT.jar.
Attempting to download geronimo-connector-1.0-SNAPSHOT.jar.
Attempting to download geronimo-connector-builder-1.0-SNAPSHOT.jar.
Attempting to download geronimo-core-1.0-SNAPSHOT.jar.
Attempting to download geronimo-derby-1.0-SNAPSHOT.jar.
Attempting to download geronimo-directory-1.0-SNAPSHOT.jar.
Attempting to download geronimo-j2ee-1.0-SNAPSHOT.jar.
Attempting to download geronimo-j2ee-builder-1.0-SNAPSHOT.jar.
Attempting to download geronimo-j2ee-schema-1.0-SNAPSHOT.jar.
Attempting to download geronimo-jetty-1.0-SNAPSHOT.jar.
Attempting to download geronimo-jetty-builder-1.0-SNAPSHOT.jar.
Attempting to download geronimo-jmxremoting-1.0-SNAPSHOT.jar.
Attempting to download geronimo-mail-1.0-SNAPSHOT.jar.
Attempting to download geronimo-management-1.0-SNAPSHOT.jar.
Attempting to download geronimo-naming-1.0-SNAPSHOT.jar.
Attempting to download geronimo-naming-builder-1.0-SNAPSHOT.jar.
Attempting to download geronimo-security-1.0-SNAPSHOT.jar.
Attempting to download geronimo-security-builder-1.0-SNAPSHOT.jar.
Attempting to download geronimo-service-builder-1.0-SNAPSHOT.jar.
Attempting to download geronimo-timer-1.0-SNAPSHOT.jar.
Attempting to download geronimo-tomcat-1.0-SNAPSHOT.jar.
Attempting to download geronimo-transaction-1.0-SNAPSHOT.jar.
Attempting to download geronimo-web-builder-1.0-SNAPSHOT.jar.
Attempting to download geronimo-webservices-1.0-SNAPSHOT.jar.
build:start:

clean:clean:
    [delete] Deleting directory /home/continuum/build/work/4/assemblies/j2ee-installer/target
+----------------------------------------
| Executing clean:clean Geronimo Assembly for a J2EE Server running Jetty
| Memory: 12M/16M
+----------------------------------------
DEPRECATED: the default goal should be specified in the <build> section of project.xml
instead of maven.xml
DEPRECATED: the default goal should be specified in the <build> section of project.xml
instead of maven.xml

build:end:

Attempting to download ldap-realm-1.0-SNAPSHOT.car.
Attempting to download javamail-1.0-SNAPSHOT.car.
Attempting to download ldap-demo-jetty-1.0-SNAPSHOT.car.
Attempting to download daytrader-derby-jetty-1.0-SNAPSHOT.car.
Attempting to download daytrader-derby-jetty-streamer-client-1.0-SNAPSHOT.car.
build:start:

clean:clean:
+----------------------------------------
| Executing clean:clean Geronimo Assembly for a J2EE Server running Tomcat
| Memory: 12M/16M
+----------------------------------------
DEPRECATED: the default goal should be specified in the <build> section of project.xml
instead of maven.xml
DEPRECATED: the default goal should be specified in the <build> section of project.xml
instead of maven.xml

build:end:

Attempting to download ldap-demo-tomcat-1.0-SNAPSHOT.car.
Attempting to download servlets-examples-tomcat-1.0-SNAPSHOT.car.
Attempting to download jsp-examples-tomcat-1.0-SNAPSHOT.car.
Attempting to download daytrader-derby-tomcat-1.0-SNAPSHOT.car.
Attempting to download daytrader-derby-tomcat-streamer-client-1.0-SNAPSHOT.car.
build:start:

clean:clean:

build:end:



multiproject:install:
multiproject:projects-init:

multiproject:goal:
Starting the reactor...
Our processing order:
Geronimo Assembly for an IZPack Installer
Geronimo Assembly for a J2EE Server running Jetty
Geronimo Assembly for a J2EE Server running Tomcat
+----------------------------------------
| Executing multiproject:install-callback Geronimo Assembly for an IZPack Installer
| Memory: 13M/16M
+----------------------------------------
DEPRECATED: the default goal should be specified in the <build> section of project.xml
instead of maven.xml
DEPRECATED: the default goal should be specified in the <build> section of project.xml
instead of maven.xml
build:start:

multiproject:install-callback:
    [echo] Running assemble:install for Geronimo Assembly for an IZPack Installer
assemble:install:
clean:clean:

clean:

assemble:assemble-prepare:
    [mkdir] Created dir: /home/continuum/build/work/4/assemblies/j2ee-installer/target/geronimo-1.0-SNAPSHOT
    [copy] Copying 15 files to /home/continuum/build/work/4/assemblies/j2ee-installer/target/geronimo-1.0-SNAPSHOT

assemble:assemble:
assemble:assemble-repository:
    [mkdir] Created dir: /home/continuum/build/work/4/assemblies/j2ee-installer/target/geronimo-1.0-SNAPSHOT/repository
    [copy] Copying 40 files to /home/continuum/build/work/4/assemblies/j2ee-installer/target/geronimo-1.0-SNAPSHOT/repository

assemble:assemble-lib:
    [mkdir] Created dir: /home/continuum/build/work/4/assemblies/j2ee-installer/target/geronimo-1.0-SNAPSHOT/lib
    [copy] Copying 15 files to /home/continuum/build/work/4/assemblies/j2ee-installer/target/geronimo-1.0-SNAPSHOT/lib
    [mkdir] Created dir: /home/continuum/build/work/4/assemblies/j2ee-installer/target/geronimo-1.0-SNAPSHOT/lib/endorsed
    [copy] Copying 2 files to /home/continuum/build/work/4/assemblies/j2ee-installer/target/geronimo-1.0-SNAPSHOT/lib/endorsed
    [mkdir] Created dir: /home/continuum/build/work/4/assemblies/j2ee-installer/target/geronimo-1.0-SNAPSHOT/lib/extension

assemble:assemble-unpack:
    [unjar] Expanding: /home/continuum/.maven/repository/geronimo/jars/geronimo-scripts-1.0-SNAPSHOT.jar
into /home/continuum/build/work/4/assemblies/j2ee-installer/target/geronimo-1.0-SNAPSHOT

assemble:assemble-configurations:
    [mkdir] Created dir: /home/continuum/build/work/4/assemblies/j2ee-installer/target/geronimo-1.0-SNAPSHOT/config-store
Installed configuration geronimo/j2ee-system/1.0-SNAPSHOT/car
    [copy] Copying 1 file to /home/continuum/build/work/4/assemblies/j2ee-installer/target/geronimo-1.0-SNAPSHOT/bin
Installed configuration geronimo/rmi-naming/1.0-SNAPSHOT/car
Copying geronimo/geronimo-activation/1.0-SNAPSHOT/jar
Copying geronimo/geronimo-management/1.0-SNAPSHOT/jar
Copying geronimo/geronimo-j2ee/1.0-SNAPSHOT/jar
Copying geronimo/geronimo-core/1.0-SNAPSHOT/jar
Copying geronimo/geronimo-naming/1.0-SNAPSHOT/jar
Copying geronimo/geronimo-transaction/1.0-SNAPSHOT/jar
Copying geronimo/geronimo-security/1.0-SNAPSHOT/jar
Copying geronimo/geronimo-webservices/1.0-SNAPSHOT/jar
Copying concurrent/concurrent/1.3.4/jar
Copying tranql/tranql/1.2.1/jar
Copying howl/howl-logger/0.1.11/jar
Copying antlr/antlr/2.7.2/jar
Copying activeio/activeio/2.0-r118/jar
Configuration geronimo/j2ee-system/1.0-SNAPSHOT/car already present in configuration store
Installed configuration geronimo/j2ee-server/1.0-SNAPSHOT/car
Copying geronimo/geronimo-connector/1.0-SNAPSHOT/jar
Copying geronimo/geronimo-timer/1.0-SNAPSHOT/jar
Copying geronimo/geronimo-client/1.0-SNAPSHOT/jar
Copying geronimo/geronimo-axis/1.0-SNAPSHOT/jar
Copying axis/axis/1.4-SNAPSHOT/jar
Copying commons-discovery/commons-discovery/0.2/jar
Copying wsdl4j/wsdl4j/1.5.2/jar
Copying openejb/openejb-core/2.0-SNAPSHOT/jar
Copying geronimo-spec/geronimo-spec-corba/2.3-rc4/jar
Copying xstream/xstream/1.0.2/jar
Copying xpp3/xpp3/1.1.3.3/jar
Copying asm/asm/1.4.3/jar
Copying activemq/activemq-gbean-management/3.2.1/jar
Copying scout/jaxr-api/0.5/jar
Copying scout/scout/0.5/jar
Copying juddi/juddi/0.9rc4/jar
Copying jdom/jdom/1.0/jar
Copying geronimo/geronimo-derby/1.0-SNAPSHOT/jar
Copying org.apache.derby/derby/10.1.1.0/jar
Copying org.apache.derby/derbynet/10.1.1.0/jar
Configuration geronimo/rmi-naming/1.0-SNAPSHOT/car already present in configuration store
Installed configuration geronimo/j2ee-security/1.0-SNAPSHOT/car
Copying geronimo/geronimo-jmxremoting/1.0-SNAPSHOT/jar
Configuration geronimo/rmi-naming/1.0-SNAPSHOT/car already present in configuration store
Installed configuration geronimo/j2ee-corba/1.0-SNAPSHOT/car
Configuration geronimo/j2ee-server/1.0-SNAPSHOT/car already present in configuration store
Installed configuration geronimo/jetty/1.0-SNAPSHOT/car
Copying geronimo/geronimo-jetty/1.0-SNAPSHOT/jar
Copying jetty/org.mortbay.jetty/5.1.9/jar
Copying tomcat/jasper-compiler/5.5.12/jar
Copying tomcat/jasper-compiler-jdt/5.5.12/jar
Copying tomcat/jasper-runtime/5.5.12/jar
Copying commons-el/commons-el/1.0/jar
Copying springframework/spring/1.2.5/jar
Copying wadi/wadi-core/2.0M1/jar
Copying wadi/wadi-jetty5/2.0M1/jar
Configuration geronimo/rmi-naming/1.0-SNAPSHOT/car already present in configuration store
Installed configuration geronimo/tomcat/1.0-SNAPSHOT/car
Copying geronimo/geronimo-tomcat/1.0-SNAPSHOT/jar
Copying activecluster/activecluster/1.2-20051115174934/jar
Copying tomcat/catalina/5.5.12/jar
Copying tomcat/tomcat-ajp/5.5.12/jar
Copying tomcat/catalina-cluster/5.5.12/jar
Copying tomcat/catalina-optional/5.5.12/jar
Copying tomcat/tomcat-coyote/5.5.12/jar
Copying tomcat/tomcat-http/5.5.12/jar
Copying tomcat/tomcat-util/5.5.12/jar
Copying tomcat/naming-resources/5.5.12/jar
Copying tomcat/servlets-default/5.5.12/jar
Copying tomcat/servlets-invoker/5.5.12/jar
Copying commons-beanutils/commons-beanutils/1.6.1/jar
Copying commons-collections/commons-collections/3.1/jar
Copying commons-digester/commons-digester/1.6/jar
Copying commons-modeler/commons-modeler/1.1/jar
Copying regexp/regexp/1.3/jar
Copying wadi/wadi-tomcat55/2.0M1/jar
Configuration geronimo/rmi-naming/1.0-SNAPSHOT/car already present in configuration store
Installed configuration geronimo/directory/1.0-SNAPSHOT/car
Copying geronimo/geronimo-directory/1.0-SNAPSHOT/jar
Copying directory/apacheds-core/0.9.2/jar
Copying directory/apacheds-shared/0.9.2/jar
Copying directory-asn1/asn1-codec/0.3.2/jar
Copying directory-shared/apache-ldapber-provider/0.9.2/jar
Copying directory-asn1/asn1-ber/0.3.2/jar
Copying directory-asn1/asn1-der/0.3.2/jar
Copying jdbm/jdbm/0.20-dev/jar
Copying oro/oro/2.0.8/jar
Copying commons-lang/commons-lang/2.0/jar
Copying commons-io/commons-io/1.0/jar
Copying commons-primitives/commons-primitives/20041207.202534/jar
Copying directory-shared/ldap-common/0.9.2/jar
Copying directory-shared/kerberos-common/0.5/jar
Copying directory-network/mina/0.7.3/jar
Copying directory-protocols/kerberos-protocol/0.5/jar
Copying directory-protocols/ldap-protocol/0.9.2/jar
Copying org.slf4j/slf4j-simple/1.0-beta7/jar
Configuration geronimo/j2ee-server/1.0-SNAPSHOT/car already present in configuration store
Installed configuration geronimo/system-database/1.0-SNAPSHOT/car
Configuration geronimo/j2ee-server/1.0-SNAPSHOT/car already present in configuration store
Installed configuration geronimo/activemq-broker/1.0-SNAPSHOT/car
Copying activemq/activemq-core/3.2.1/jar
Copying activemq/activemq-gbean/3.2.1/jar
Configuration geronimo/system-database/1.0-SNAPSHOT/car already present in configuration store
Installed configuration geronimo/activemq/1.0-SNAPSHOT/car
Configuration geronimo/activemq-broker/1.0-SNAPSHOT/car already present in configuration store
Installed configuration geronimo/geronimo-gbean-deployer/1.0-SNAPSHOT/car
Copying geronimo/geronimo-service-builder/1.0-SNAPSHOT/jar
Copying xmlbeans/xbean/2.0.0/jar
Copying stax/stax-api/1.0/jar
Installed configuration geronimo/hot-deployer/1.0-SNAPSHOT/car
Copying geronimo/geronimo-hot-deploy/1.0-SNAPSHOT/jar
Configuration geronimo/rmi-naming/1.0-SNAPSHOT/car already present in configuration store
Installed configuration geronimo/j2ee-deployer/1.0-SNAPSHOT/car
Copying geronimo/geronimo-j2ee-schema/1.0-SNAPSHOT/jar
Copying geronimo/geronimo-j2ee-builder/1.0-SNAPSHOT/jar
Copying geronimo/geronimo-client-builder/1.0-SNAPSHOT/jar
Copying geronimo/geronimo-naming-builder/1.0-SNAPSHOT/jar
Copying geronimo/geronimo-security-builder/1.0-SNAPSHOT/jar
Copying geronimo/geronimo-axis-builder/1.0-SNAPSHOT/jar
Copying geronimo/geronimo-web-builder/1.0-SNAPSHOT/jar
Copying openejb/openejb-builder/2.0-SNAPSHOT/jar
Copying openejb/openejb-pkgen-builder/2.0-SNAPSHOT/jar
Copying geronimo/geronimo-connector-builder/1.0-SNAPSHOT/jar
Configuration geronimo/geronimo-gbean-deployer/1.0-SNAPSHOT/car already present in configuration
store
Configuration geronimo/j2ee-server/1.0-SNAPSHOT/car already present in configuration store
Installed configuration geronimo/jetty-deployer/1.0-SNAPSHOT/car
Copying geronimo/geronimo-jetty-builder/1.0-SNAPSHOT/jar
Configuration geronimo/j2ee-deployer/1.0-SNAPSHOT/car already present in configuration store
Configuration geronimo/jetty/1.0-SNAPSHOT/car already present in configuration store
Installed configuration geronimo/welcome-jetty/1.0-SNAPSHOT/car
Configuration geronimo/j2ee-server/1.0-SNAPSHOT/car already present in configuration store
Configuration geronimo/jetty/1.0-SNAPSHOT/car already present in configuration store
Installed configuration geronimo/servlets-examples-jetty/1.0-SNAPSHOT/car
Configuration geronimo/j2ee-server/1.0-SNAPSHOT/car already present in configuration store
Configuration geronimo/jetty/1.0-SNAPSHOT/car already present in configuration store
Installed configuration geronimo/jsp-examples-jetty/1.0-SNAPSHOT/car
Configuration geronimo/j2ee-server/1.0-SNAPSHOT/car already present in configuration store
Configuration geronimo/jetty/1.0-SNAPSHOT/car already present in configuration store
Installed configuration geronimo/webconsole-jetty/1.0-SNAPSHOT/car
Copying portlet-api/portlet-api/1.0/jar
Copying org.apache.pluto/pluto/1.0.1/jar
Copying geronimo/geronimo-console-core/1.0-SNAPSHOT/jar
Copying geronimo/geronimo-test-ddbean/1.0-SNAPSHOT/jar
Copying geronimo/geronimo-deploy-config/1.0-SNAPSHOT/jar
Copying geronimo/geronimo-converter/1.0-SNAPSHOT/jar
Configuration geronimo/j2ee-server/1.0-SNAPSHOT/car already present in configuration store
Configuration geronimo/jetty/1.0-SNAPSHOT/car already present in configuration store
Installed configuration geronimo/remote-deploy-jetty/1.0-SNAPSHOT/car
Copying geronimo/geronimo-remote-deploy-lib/1.0-SNAPSHOT/jar
Configuration geronimo/j2ee-server/1.0-SNAPSHOT/car already present in configuration store
Configuration geronimo/jetty/1.0-SNAPSHOT/car already present in configuration store
Installed configuration geronimo/jmxdebug-jetty/1.0-SNAPSHOT/car
Configuration geronimo/j2ee-server/1.0-SNAPSHOT/car already present in configuration store
Configuration geronimo/jetty/1.0-SNAPSHOT/car already present in configuration store
Installed configuration geronimo/uddi-jetty/1.0-SNAPSHOT/car
Copying geronimo/geronimo-uddi-db/1.0-SNAPSHOT/jar
Configuration geronimo/system-database/1.0-SNAPSHOT/car already present in configuration store
Configuration geronimo/jetty/1.0-SNAPSHOT/car already present in configuration store
Installed configuration geronimo/tomcat-deployer/1.0-SNAPSHOT/car
Copying geronimo/geronimo-tomcat-builder/1.0-SNAPSHOT/jar
Configuration geronimo/j2ee-deployer/1.0-SNAPSHOT/car already present in configuration store
Configuration geronimo/tomcat/1.0-SNAPSHOT/car already present in configuration store
Installed configuration geronimo/welcome-tomcat/1.0-SNAPSHOT/car
Configuration geronimo/j2ee-server/1.0-SNAPSHOT/car already present in configuration store
Configuration geronimo/tomcat/1.0-SNAPSHOT/car already present in configuration store
Installed configuration geronimo/webconsole-tomcat/1.0-SNAPSHOT/car
Configuration geronimo/j2ee-server/1.0-SNAPSHOT/car already present in configuration store
Configuration geronimo/tomcat/1.0-SNAPSHOT/car already present in configuration store
Installed configuration geronimo/remote-deploy-tomcat/1.0-SNAPSHOT/car
Configuration geronimo/j2ee-server/1.0-SNAPSHOT/car already present in configuration store
Configuration geronimo/tomcat/1.0-SNAPSHOT/car already present in configuration store
Installed configuration geronimo/jmxdebug-tomcat/1.0-SNAPSHOT/car
Configuration geronimo/j2ee-server/1.0-SNAPSHOT/car already present in configuration store
Configuration geronimo/tomcat/1.0-SNAPSHOT/car already present in configuration store
Installed configuration geronimo/uddi-tomcat/1.0-SNAPSHOT/car
Configuration geronimo/system-database/1.0-SNAPSHOT/car already present in configuration store
Configuration geronimo/tomcat/1.0-SNAPSHOT/car already present in configuration store
Installed configuration geronimo/client-system/1.0-SNAPSHOT/car
    [copy] Copying 1 file to /home/continuum/build/work/4/assemblies/j2ee-installer/target/geronimo-1.0-SNAPSHOT/bin
Installed configuration geronimo/client/1.0-SNAPSHOT/car
Configuration geronimo/client-system/1.0-SNAPSHOT/car already present in configuration store
Installed configuration geronimo/client-security/1.0-SNAPSHOT/car
Configuration geronimo/client/1.0-SNAPSHOT/car already present in configuration store
Installed configuration geronimo/client-corba/1.0-SNAPSHOT/car
Configuration geronimo/client/1.0-SNAPSHOT/car already present in configuration store
Installed configuration geronimo/online-deployer/1.0-SNAPSHOT/car
    [copy] Copying 1 file to /home/continuum/build/work/4/assemblies/j2ee-installer/target/geronimo-1.0-SNAPSHOT/bin
Installed configuration geronimo/shutdown/1.0-SNAPSHOT/car
    [copy] Copying 1 file to /home/continuum/build/work/4/assemblies/j2ee-installer/target/geronimo-1.0-SNAPSHOT/bin

assemble:assemble-schemas:
    [mkdir] Created dir: /home/continuum/build/work/4/assemblies/j2ee-installer/target/geronimo-1.0-SNAPSHOT/schema
    [mkdir] Created dir: /home/continuum/build/work/4/assemblies/j2ee-installer/target/schema
    [unjar] Expanding: /home/continuum/build/work/4/assemblies/j2ee-installer/target/geronimo-1.0-SNAPSHOT/repository/geronimo/jars/geronimo-axis-builder-1.0-SNAPSHOT.jar
into /home/continuum/build/work/4/assemblies/j2ee-installer/target/schema
    [unjar] Expanding: /home/continuum/build/work/4/assemblies/j2ee-installer/target/geronimo-1.0-SNAPSHOT/repository/geronimo/jars/geronimo-client-builder-1.0-SNAPSHOT.jar
into /home/continuum/build/work/4/assemblies/j2ee-installer/target/schema
    [unjar] Expanding: /home/continuum/build/work/4/assemblies/j2ee-installer/target/geronimo-1.0-SNAPSHOT/repository/geronimo/jars/geronimo-connector-builder-1.0-SNAPSHOT.jar
into /home/continuum/build/work/4/assemblies/j2ee-installer/target/schema
    [unjar] Expanding: /home/continuum/build/work/4/assemblies/j2ee-installer/target/geronimo-1.0-SNAPSHOT/repository/geronimo/jars/geronimo-j2ee-builder-1.0-SNAPSHOT.jar
into /home/continuum/build/work/4/assemblies/j2ee-installer/target/schema
    [unjar] Expanding: /home/continuum/build/work/4/assemblies/j2ee-installer/target/geronimo-1.0-SNAPSHOT/repository/geronimo/jars/geronimo-j2ee-schema-1.0-SNAPSHOT.jar
into /home/continuum/build/work/4/assemblies/j2ee-installer/target/schema
    [unjar] Expanding: /home/continuum/build/work/4/assemblies/j2ee-installer/target/geronimo-1.0-SNAPSHOT/repository/geronimo/jars/geronimo-jetty-builder-1.0-SNAPSHOT.jar
into /home/continuum/build/work/4/assemblies/j2ee-installer/target/schema
    [unjar] Expanding: /home/continuum/build/work/4/assemblies/j2ee-installer/target/geronimo-1.0-SNAPSHOT/repository/geronimo/jars/geronimo-naming-builder-1.0-SNAPSHOT.jar
into /home/continuum/build/work/4/assemblies/j2ee-installer/target/schema
    [unjar] Expanding: /home/continuum/build/work/4/assemblies/j2ee-installer/target/geronimo-1.0-SNAPSHOT/repository/geronimo/jars/geronimo-security-builder-1.0-SNAPSHOT.jar
into /home/continuum/build/work/4/assemblies/j2ee-installer/target/schema
    [unjar] Expanding: /home/continuum/build/work/4/assemblies/j2ee-installer/target/geronimo-1.0-SNAPSHOT/repository/geronimo/jars/geronimo-service-builder-1.0-SNAPSHOT.jar
into /home/continuum/build/work/4/assemblies/j2ee-installer/target/schema
    [unjar] Expanding: /home/continuum/build/work/4/assemblies/j2ee-installer/target/geronimo-1.0-SNAPSHOT/repository/geronimo/jars/geronimo-tomcat-builder-1.0-SNAPSHOT.jar
into /home/continuum/build/work/4/assemblies/j2ee-installer/target/schema
    [unjar] Expanding: /home/continuum/build/work/4/assemblies/j2ee-installer/target/geronimo-1.0-SNAPSHOT/repository/geronimo/jars/geronimo-web-builder-1.0-SNAPSHOT.jar
into /home/continuum/build/work/4/assemblies/j2ee-installer/target/schema
    [unjar] Expanding: /home/continuum/build/work/4/assemblies/j2ee-installer/target/geronimo-1.0-SNAPSHOT/repository/openejb/jars/openejb-builder-2.0-SNAPSHOT.jar
into /home/continuum/build/work/4/assemblies/j2ee-installer/target/schema
    [unjar] Expanding: /home/continuum/build/work/4/assemblies/j2ee-installer/target/geronimo-1.0-SNAPSHOT/repository/openejb/jars/openejb-pkgen-builder-2.0-SNAPSHOT.jar
into /home/continuum/build/work/4/assemblies/j2ee-installer/target/schema
    [copy] Copying 41 files to /home/continuum/build/work/4/assemblies/j2ee-installer/target/geronimo-1.0-SNAPSHOT/schema


izpack:izpack-prepare:
    [echo] izpack-prepare is running
    [echo] Processing installer file geronimo-izpack.xml
    [echo] Processing installer file izpack-process.xml
    [echo] Processing installer file izpack-user-input.xml

izpack:izpack-installer-build:
    [echo] IZPack installer build is running.
    [echo] IZPack Version is 3.8.0
    [java] 
    [java] .::  IzPack - Version 3.8.0 ::.
    [java] 
    [java] < compiler specifications version : 1.0 >
    [java] 
    [java] - Copyright (C) 2001-2005 Julien Ponge
    [java] - Visit http://www.izforge.com/ for the latests releases
    [java] - Released under the terms of the Apache Software License version 2.0.
    [java] 
    [java] -> Processing  : /home/continuum/build/work/4/assemblies/j2ee-installer/target/geronimo-1.0-SNAPSHOT/geronimo-izpack.xml
    [java] -> Output      : /home/continuum/build/work/4/assemblies/j2ee-installer/target/geronimo-installer-1.0-SNAPSHOT.jar
    [java] -> Base path   : .
    [java] -> Kind        : standard
    [java] -> Compression : default
    [java] -> Compr. level: -1
    [java] 
    [java] Adding resource: IzPack.uninstaller
    [java] Setting the installer information
    [java] Adding content of jar: file:/home/continuum/.maven/repository/izpack/jars/standalone-compiler-3.8.0.jar!/lib/liquidlnf.jar
    [java] Setting the GUI preferences
    [java] Adding langpack: eng
    [java] -> Fatal error :
    [java] Adding resource: flag.eng
    [java] Adding resource: Installer.image
    [java]    /home/continuum/build/work/4/assemblies/j2ee-installer/target/geronimo-1.0-SNAPSHOT/geronimo-izpack.xml:22:
Resource not found: /home/continuum/build/work/4/assemblies/j2ee-installer/target/geronimo-1.0-SNAPSHOT/LICENSE.txt
    [java] com.izforge.izpack.compiler.CompilerException: /home/continuum/build/work/4/assemblies/j2ee-installer/target/geronimo-1.0-SNAPSHOT/geronimo-izpack.xml:22:
Resource not found: /home/continuum/build/work/4/assemblies/j2ee-installer/target/geronimo-1.0-SNAPSHOT/LICENSE.txt
    [java] 	at com.izforge.izpack.compiler.CompilerConfig.parseError(CompilerConfig.java:1518)
    [java] 	at com.izforge.izpack.compiler.CompilerConfig.findProjectResource(CompilerConfig.java:1447)
    [java] 	at com.izforge.izpack.compiler.CompilerConfig.addResources(CompilerConfig.java:1044)
    [java] 	at com.izforge.izpack.compiler.CompilerConfig.executeCompiler(CompilerConfig.java:313)
    [java] 	at com.izforge.izpack.compiler.CompilerConfig.main(CompilerConfig.java:1847)
    [java] 	at com.izforge.izpack.compiler.Compiler.main(Compiler.java:620)
    [java] 
    [java] (tip : use -? to get the commmand line parameters)
    [java] [ERROR] Java Result: 1

BUILD FAILED
File...... /home/continuum/.maven/cache/maven-multiproject-plugin-1.4.1/plugin.jelly
Element... maven:reactor
Line...... 218
Column.... -1
Unable to obtain goal [multiproject:install-callback] -- /home/continuum/.maven/cache/geronimo-izpack-plugin-1.0-SNAPSHOT/plugin.jelly:77:-1:
<ant:copy> Warning: Could not find file /home/continuum/build/work/4/assemblies/j2ee-installer/target/geronimo-installer-1.0-SNAPSHOT.jar
to copy.
Total time   : 1 minutes 30 seconds 
Finished at  : Saturday, December 17, 2005 2:29:53 PM PST


****************************************************************************



Mime
View raw message