geronimo-scm mailing list archives

Site index · List index
Message view « Date » · « Thread »
Top « Date » · « Thread »
From continuum <contin...@stan.gbuild.org>
Subject [continuum] BUILD FAILURE: Geronimo
Date Fri, 16 Dec 2005 18:08:53 GMT
Online report : http://ci.gbuild.org/continuum/target/ProjectBuild.vm/view/ProjectBuild/id/1/buildId/515
Build statistics:
  State: Failed
  Previous State: Failed
  Started at: Fri, 16 Dec 2005 10:07:16 -0800
  Finished at: Fri, 16 Dec 2005 10:08:52 -0800
  Total time: 1m 35s
  Build Trigger: Forced
  Exit code: 70
  Building machine hostname: stan.gbuild.org
  Operating system : Linux(unknown)
  Java version : 1.4.2_08(Sun Microsystems Inc.)

Changes
      No files changed
  
****************************************************************************
Output:
****************************************************************************
 __  __
|  \/  |__ _Apache__ ___
| |\/| / _` \ V / -_) ' \  ~ intelligent projects ~
|_|  |_\__,_|\_/\___|_||_|  v. 1.1-beta-2

DEPRECATED: the default goal should be specified in the <build> section of project.xml
instead of maven.xml
DEPRECATED: the default goal should be specified in the <build> section of project.xml
instead of maven.xml
Starting the reactor...
Our processing order:
Geronimo :: Activation
Geronimo :: Kernel
Geronimo :: Common
Geronimo :: Util
Geronimo :: System
Geronimo :: Deployment
Geronimo :: Core
Geronimo :: Management API
Geronimo :: J2EE
Geronimo :: J2EE Schema
Geronimo :: Service :: Builder
Geronimo :: Maven Dependency Plugin
Geronimo :: Security
Geronimo :: Web Services
Geronimo :: Axis
Geronimo :: Naming
Geronimo :: Deploy :: Common Config
Geronimo :: Test :: DDBeans
Geronimo :: Transaction
Geronimo :: Connector
Geronimo :: Security :: Builder
Geronimo :: J2EE
Geronimo :: Naming :: Builder
Geronimo :: Connector :: Builder
Geronimo :: Axis :: Builder
Geronimo :: Client
Geronimo :: Client Builder
Geronimo :: Console Web
Geronimo :: Configuration Converter
Geronimo :: Web :: Builder
Geronimo :: Deploy :: JSR-88
Geronimo :: Deploy :: CLI Tool
Geronimo :: Derby
Geronimo :: Directory
Geronimo :: Deploy :: Hot Deployer
Geronimo :: JavaMail Transport
Geronimo :: Jetty
Geronimo :: Jetty :: Builder
Geronimo :: JMX Remoting
Geronimo :: Mail
Geronimo :: Scripts
Geronimo :: Timer
Geronimo :: Tomcat
Geronimo :: Tomcat :: Builder
Geronimo :: Maven Assembly Plugin
Geronimo :: Maven Deployment Plugin
Geronimo :: IZPack Installer Build Plugin
Geronimo :: Maven Packaging Plugin
+----------------------------------------
| geronimo and geronimo-plugins Geronimo :: Activation
| Memory: 4M/10M
+----------------------------------------
DEPRECATED: the default goal should be specified in the <build> section of project.xml
instead of maven.xml
build:start:

new1:
build:start:

multiproject:install-callback:
    [echo] Running jar:install for Geronimo :: Activation
java:prepare-filesystem:

java:compile:
<depend closure="false" srcdir="1.4" dump="false" destdir="/home/continuum/build/work/1/modules/activation/target/classes"></depend>
   [echo] Compiling to /home/continuum/build/work/1/modules/activation/target/classes

java:jar-resources:

test:prepare-filesystem:

test:test-resources:

test:compile:

test:test:
    [echo] NOTICE: Skipping tests; they seem to have passed already
    [echo] No tests to run.
Running post goal: test:test

jar:jar:

jar:install:
    [echo] Installing...
Uploading to geronimo/jars/geronimo-activation-1.0-SNAPSHOT.jar: 
.................... (13K)
Uploading to geronimo/poms/geronimo-activation-1.0-SNAPSHOT.pom: 
.................... (10K)

+----------------------------------------
| geronimo and geronimo-plugins Geronimo :: Kernel
| Memory: 8M/10M
+----------------------------------------
DEPRECATED: the default goal should be specified in the <build> section of project.xml
instead of maven.xml
DEPRECATED: the default goal should be specified in the <build> section of project.xml
instead of maven.xml

build:end:

build:start:

multiproject:install-callback:
    [echo] Running jar:install for Geronimo :: Kernel
Tag library requested that is not present: 'xmlbeans2:maven' in plugin: 'null'
java:prepare-filesystem:

java:compile:
<depend closure="false" srcdir="1.4" dump="false" destdir="/home/continuum/build/work/1/modules/kernel/target/classes"></depend>
   [echo] Compiling to /home/continuum/build/work/1/modules/kernel/target/classes

java:jar-resources:

test:prepare-filesystem:

test:test-resources:

test:compile:

test:test:
    [echo] NOTICE: Skipping tests; they seem to have passed already
    [echo] No tests to run.
Running post goal: test:test

jar:jar:

jar:install:
    [echo] Installing...
Uploading to geronimo/jars/geronimo-kernel-1.0-SNAPSHOT.jar: 
.................... (223K)
Uploading to geronimo/poms/geronimo-kernel-1.0-SNAPSHOT.pom: 
.................... (10K)

+----------------------------------------
| geronimo and geronimo-plugins Geronimo :: Common
| Memory: 9M/10M
+----------------------------------------
DEPRECATED: the default goal should be specified in the <build> section of project.xml
instead of maven.xml

build:end:

Attempting to download geronimo-kernel-1.0-SNAPSHOT.jar.
build:start:

multiproject:install-callback:
    [echo] Running jar:install for Geronimo :: Common
java:prepare-filesystem:

java:compile:
<depend closure="false" srcdir="1.4" dump="false" destdir="/home/continuum/build/work/1/modules/common/target/classes"></depend>
   [echo] Compiling to /home/continuum/build/work/1/modules/common/target/classes

java:jar-resources:

test:prepare-filesystem:

test:test-resources:

test:compile:

test:test:
    [echo] NOTICE: Skipping tests; they seem to have passed already
    [echo] No tests to run.
Running post goal: test:test

jar:jar:

jar:install:
    [echo] Installing...
Uploading to geronimo/jars/geronimo-common-1.0-SNAPSHOT.jar: 
.................... (35K)
Uploading to geronimo/poms/geronimo-common-1.0-SNAPSHOT.pom: 
.................... (9K)

+----------------------------------------
| geronimo and geronimo-plugins Geronimo :: Util
| Memory: 9M/14M
+----------------------------------------
DEPRECATED: the default goal should be specified in the <build> section of project.xml
instead of maven.xml

build:end:

build:start:

multiproject:install-callback:
    [echo] Running jar:install for Geronimo :: Util
java:prepare-filesystem:

java:compile:
<depend closure="false" srcdir="1.4" dump="false" destdir="/home/continuum/build/work/1/modules/util/target/classes"></depend>
   [echo] Compiling to /home/continuum/build/work/1/modules/util/target/classes

java:jar-resources:

test:prepare-filesystem:

test:test-resources:

test:compile:

test:test:
    [echo] NOTICE: Skipping tests; they seem to have passed already
    [echo] No tests to run.
Running post goal: test:test

jar:jar:

jar:install:
    [echo] Installing...
Uploading to geronimo/jars/geronimo-util-1.0-SNAPSHOT.jar: 
.................... (242K)
Uploading to geronimo/poms/geronimo-util-1.0-SNAPSHOT.pom: 
.................... (9K)

+----------------------------------------
| geronimo and geronimo-plugins Geronimo :: System
| Memory: 9M/14M
+----------------------------------------
DEPRECATED: the default goal should be specified in the <build> section of project.xml
instead of maven.xml
DEPRECATED: the default goal should be specified in the <build> section of project.xml
instead of maven.xml

build:end:

Attempting to download geronimo-common-1.0-SNAPSHOT.jar.
Attempting to download geronimo-util-1.0-SNAPSHOT.jar.
build:start:

multiproject:install-callback:
    [echo] Running jar:install for Geronimo :: System
java:prepare-filesystem:

java:compile:
<depend closure="false" srcdir="1.4" dump="false" destdir="/home/continuum/build/work/1/modules/system/target/classes"></depend>
   [echo] Compiling to /home/continuum/build/work/1/modules/system/target/classes
Running post goal: java:compile

java:jar-resources:

test:prepare-filesystem:

test:test-resources:
Running post goal: test:test-resources
    [delete] Deleting directory /home/continuum/build/work/1/modules/system/target/tmp
    [mkdir] Created dir: /home/continuum/build/work/1/modules/system/target/tmp

test:compile:

test:test:
    [echo] NOTICE: Skipping tests; they seem to have passed already
    [echo] No tests to run.
Running post goal: test:test

jar:jar:
    [jar] Building jar: /home/continuum/build/work/1/modules/system/target/geronimo-system-1.0-SNAPSHOT.jar

jar:install:
    [echo] Installing...
Uploading to geronimo/jars/geronimo-system-1.0-SNAPSHOT.jar: 
.................... (142K)
Uploading to geronimo/poms/geronimo-system-1.0-SNAPSHOT.pom: 
.................... (10K)

+----------------------------------------
| geronimo and geronimo-plugins Geronimo :: Deployment
| Memory: 11M/14M
+----------------------------------------
DEPRECATED: the default goal should be specified in the <build> section of project.xml
instead of maven.xml
DEPRECATED: the default goal should be specified in the <build> section of project.xml
instead of maven.xml

build:end:

Attempting to download geronimo-system-1.0-SNAPSHOT.jar.
build:start:

multiproject:install-callback:
    [echo] Running jar:install for Geronimo :: Deployment
java:prepare-filesystem:

java:compile:
<depend closure="false" srcdir="1.4" dump="false" destdir="/home/continuum/build/work/1/modules/deployment/target/classes"></depend>
   [echo] Compiling to /home/continuum/build/work/1/modules/deployment/target/classes

java:jar-resources:

test:prepare-filesystem:

test:test-resources:

test:compile:

test:test:
    [echo] NOTICE: Skipping tests; they seem to have passed already
    [echo] No tests to run.
Running post goal: test:test

jar:jar:

jar:install:
    [echo] Installing...
Uploading to geronimo/jars/geronimo-deployment-1.0-SNAPSHOT.jar: 
.................... (51K)
Uploading to geronimo/poms/geronimo-deployment-1.0-SNAPSHOT.pom: 
.................... (10K)

+----------------------------------------
| geronimo and geronimo-plugins Geronimo :: Core
| Memory: 12M/14M
+----------------------------------------
DEPRECATED: the default goal should be specified in the <build> section of project.xml
instead of maven.xml
DEPRECATED: the default goal should be specified in the <build> section of project.xml
instead of maven.xml

build:end:

build:start:

multiproject:install-callback:
    [echo] Running jar:install for Geronimo :: Core
java:prepare-filesystem:

java:compile:
<depend closure="false" srcdir="1.4" dump="false" destdir="/home/continuum/build/work/1/modules/core/target/classes"></depend>
   [echo] Compiling to /home/continuum/build/work/1/modules/core/target/classes

java:jar-resources:

test:prepare-filesystem:

test:test-resources:

test:compile:

test:test:
    [echo] NOTICE: Skipping tests; they seem to have passed already
    [echo] No tests to run.
Running post goal: test:test

jar:jar:

jar:install:
    [echo] Installing...
Uploading to geronimo/jars/geronimo-core-1.0-SNAPSHOT.jar: 
.................... (35K)
Uploading to geronimo/poms/geronimo-core-1.0-SNAPSHOT.pom: 
.................... (10K)

+----------------------------------------
| geronimo and geronimo-plugins Geronimo :: Management API
| Memory: 13M/14M
+----------------------------------------
DEPRECATED: the default goal should be specified in the <build> section of project.xml
instead of maven.xml
DEPRECATED: the default goal should be specified in the <build> section of project.xml
instead of maven.xml

build:end:

build:start:

multiproject:install-callback:
    [echo] Running jar:install for Geronimo :: Management API
java:prepare-filesystem:

java:compile:
<depend closure="false" srcdir="1.4" dump="false" destdir="/home/continuum/build/work/1/modules/management/target/classes"></depend>
   [echo] Compiling to /home/continuum/build/work/1/modules/management/target/classes

java:jar-resources:

test:prepare-filesystem:

test:test-resources:

test:compile:
    [echo] No test source files to compile.

test:test:
    [echo] NOTICE: Skipping tests; they seem to have passed already
    [echo] No tests to run.
Running post goal: test:test

jar:jar:

jar:install:
    [echo] Installing...
Uploading to geronimo/jars/geronimo-management-1.0-SNAPSHOT.jar: 
.................... (34K)
Uploading to geronimo/poms/geronimo-management-1.0-SNAPSHOT.pom: 
.................... (9K)

+----------------------------------------
| geronimo and geronimo-plugins Geronimo :: J2EE
| Memory: 8M/14M
+----------------------------------------
DEPRECATED: the default goal should be specified in the <build> section of project.xml
instead of maven.xml
DEPRECATED: the default goal should be specified in the <build> section of project.xml
instead of maven.xml

build:end:

Attempting to download geronimo-core-1.0-SNAPSHOT.jar.
Attempting to download geronimo-management-1.0-SNAPSHOT.jar.
build:start:

multiproject:install-callback:
    [echo] Running jar:install for Geronimo :: J2EE
java:prepare-filesystem:

java:compile:
<depend closure="false" srcdir="1.4" dump="false" destdir="/home/continuum/build/work/1/modules/j2ee/target/classes"></depend>
   [echo] Compiling to /home/continuum/build/work/1/modules/j2ee/target/classes

java:jar-resources:

test:prepare-filesystem:

test:test-resources:

test:compile:

test:test:
    [echo] NOTICE: Skipping tests; they seem to have passed already
    [echo] No tests to run.
Running post goal: test:test

jar:jar:

jar:install:
    [echo] Installing...
Uploading to geronimo/jars/geronimo-j2ee-1.0-SNAPSHOT.jar: 
.................... (30K)
Uploading to geronimo/poms/geronimo-j2ee-1.0-SNAPSHOT.pom: 
.................... (11K)

+----------------------------------------
| geronimo and geronimo-plugins Geronimo :: J2EE Schema
| Memory: 9M/14M
+----------------------------------------
DEPRECATED: the default goal should be specified in the <build> section of project.xml
instead of maven.xml
DEPRECATED: the default goal should be specified in the <build> section of project.xml
instead of maven.xml

build:end:

build:start:

multiproject:install-callback:
    [echo] Running jar:install for Geronimo :: J2EE Schema
java:prepare-filesystem:

java:compile:
<depend closure="false" srcdir="1.4" dump="false" destdir="/home/continuum/build/work/1/modules/j2ee-schema/target/classes"></depend>
   [echo] Compiling to /home/continuum/build/work/1/modules/j2ee-schema/target/classes

java:jar-resources:

test:prepare-filesystem:

test:test-resources:

test:compile:

test:test:
    [echo] NOTICE: Skipping tests; they seem to have passed already
    [echo] No tests to run.
Running post goal: test:test

jar:jar:

jar:install:
    [echo] Installing...
Uploading to geronimo/jars/geronimo-j2ee-schema-1.0-SNAPSHOT.jar: 
.................... (1501K)
Uploading to geronimo/poms/geronimo-j2ee-schema-1.0-SNAPSHOT.pom: 
.................... (10K)

+----------------------------------------
| geronimo and geronimo-plugins Geronimo :: Service :: Builder
| Memory: 13M/14M
+----------------------------------------
DEPRECATED: the default goal should be specified in the <build> section of project.xml
instead of maven.xml
DEPRECATED: the default goal should be specified in the <build> section of project.xml
instead of maven.xml

build:end:

Attempting to download geronimo-deployment-1.0-SNAPSHOT.jar.
Attempting to download geronimo-j2ee-1.0-SNAPSHOT.jar.
Attempting to download geronimo-j2ee-schema-1.0-SNAPSHOT.jar.
build:start:

multiproject:install-callback:
    [echo] Running jar:install for Geronimo :: Service :: Builder
java:prepare-filesystem:

java:compile:
<depend closure="false" srcdir="1.4" dump="false" destdir="/home/continuum/build/work/1/modules/service-builder/target/classes"></depend>
   [echo] Compiling to /home/continuum/build/work/1/modules/service-builder/target/classes

java:jar-resources:

test:prepare-filesystem:

test:test-resources:

test:compile:

test:test:
    [echo] NOTICE: Skipping tests; they seem to have passed already
    [echo] No tests to run.
Running post goal: test:test

jar:jar:

jar:install:
    [echo] Installing...
Uploading to geronimo/jars/geronimo-service-builder-1.0-SNAPSHOT.jar: 
.................... (190K)
Uploading to geronimo/poms/geronimo-service-builder-1.0-SNAPSHOT.pom: 
.................... (11K)

+----------------------------------------
| geronimo and geronimo-plugins Geronimo :: Maven Dependency Plugin
| Memory: 10M/16M
+----------------------------------------
DEPRECATED: the default goal should be specified in the <build> section of project.xml
instead of maven.xml

build:end:

Attempting to download geronimo-service-builder-1.0-SNAPSHOT.jar.
Artifact /geronimo/jars/geronimo-service-builder-1.0-SNAPSHOT.jar doesn't exist in remote
repository, but it exists locally.
build:start:

multiproject:install-callback:
    [echo] Running plugin:repository-install for Geronimo :: Maven Dependency Plugin
plugin:plugin:
java:prepare-filesystem:

java:compile:
    [echo] Compiling to /home/continuum/build/work/1/plugins/geronimo-dependency-plugin/target/classes

java:jar-resources:

test:prepare-filesystem:

test:test-resources:

test:compile:
    [echo] No test source files to compile.

test:test:
    [echo] No tests to run.

jar:jar:


plugin:repository-install:
    [echo] Installing...
Uploading to geronimo/plugins/geronimo-dependency-plugin-1.1.0.jar: 
.................... (9K)
Uploading to geronimo/poms/geronimo-dependency-plugin-1.1.0.pom: 
.................... (1K)

+----------------------------------------
| geronimo and geronimo-plugins Geronimo :: Security
| Memory: 11M/16M
+----------------------------------------
DEPRECATED: the default goal should be specified in the <build> section of project.xml
instead of maven.xml
DEPRECATED: the default goal should be specified in the <build> section of project.xml
instead of maven.xml

build:end:

build:start:

multiproject:install-callback:
    [echo] Running jar:install for Geronimo :: Security
java:prepare-filesystem:

java:compile:
<depend closure="false" srcdir="1.4" dump="false" destdir="/home/continuum/build/work/1/modules/security/target/classes"></depend>
   [echo] Compiling to /home/continuum/build/work/1/modules/security/target/classes

java:jar-resources:

test:prepare-filesystem:

test:test-resources:
Running post goal: test:test-resources
    [delete] Deleting directory /home/continuum/build/work/1/modules/security/target/database
    [mkdir] Created dir: /home/continuum/build/work/1/modules/security/target/database

test:compile:

test:test:
    [echo] NOTICE: Skipping tests; they seem to have passed already
    [echo] No tests to run.
Running post goal: test:test

jar:jar:

jar:install:
    [echo] Installing...
Uploading to geronimo/jars/geronimo-security-1.0-SNAPSHOT.jar: 
.................... (169K)
Uploading to geronimo/poms/geronimo-security-1.0-SNAPSHOT.pom: 
.................... (12K)

+----------------------------------------
| geronimo and geronimo-plugins Geronimo :: Web Services
| Memory: 12M/16M
+----------------------------------------
DEPRECATED: the default goal should be specified in the <build> section of project.xml
instead of maven.xml

build:end:

build:start:

multiproject:install-callback:
    [echo] Running jar:install for Geronimo :: Web Services
java:prepare-filesystem:

java:compile:
<depend closure="false" srcdir="1.4" dump="false" destdir="/home/continuum/build/work/1/modules/webservices/target/classes"></depend>
   [echo] Compiling to /home/continuum/build/work/1/modules/webservices/target/classes

java:jar-resources:

test:prepare-filesystem:

test:test-resources:

test:compile:
    [echo] No test source files to compile.

test:test:
    [echo] NOTICE: Skipping tests; they seem to have passed already
    [echo] No tests to run.
Running post goal: test:test

jar:jar:

jar:install:
    [echo] Installing...
Uploading to geronimo/jars/geronimo-webservices-1.0-SNAPSHOT.jar: 
.................... (34K)
Uploading to geronimo/poms/geronimo-webservices-1.0-SNAPSHOT.pom: 
.................... (11K)

+----------------------------------------
| geronimo and geronimo-plugins Geronimo :: Axis
| Memory: 13M/16M
+----------------------------------------
DEPRECATED: the default goal should be specified in the <build> section of project.xml
instead of maven.xml
DEPRECATED: the default goal should be specified in the <build> section of project.xml
instead of maven.xml

build:end:

Attempting to download geronimo-security-1.0-SNAPSHOT.jar.
Attempting to download geronimo-webservices-1.0-SNAPSHOT.jar.
Attempting to download axis-1.4-SNAPSHOT.jar.
2/1570K
3/1570K
5/1570K
6/1570K
8/1570K
9/1570K
11/1570K
12/1570K
13/1570K
15/1570K
16/1570K
18/1570K
19/1570K
20/1570K
22/1570K
23/1570K
25/1570K
26/1570K
30/1570K
34/1570K
37/1570K
39/1570K
40/1570K
42/1570K
43/1570K
44/1570K
46/1570K
47/1570K
49/1570K
50/1570K
52/1570K
53/1570K
54/1570K
56/1570K
57/1570K
59/1570K
60/1570K
61/1570K
65/1570K
69/1570K
73/1570K
74/1570K
76/1570K
77/1570K
78/1570K
80/1570K
81/1570K
83/1570K
84/1570K
85/1570K
87/1570K
88/1570K
90/1570K
91/1570K
93/1570K
94/1570K
95/1570K
97/1570K
98/1570K
100/1570K
101/1570K
102/1570K
104/1570K
105/1570K
107/1570K
108/1570K
109/1570K
111/1570K
112/1570K
114/1570K
115/1570K
117/1570K
118/1570K
119/1570K
121/1570K
122/1570K
124/1570K
125/1570K
126/1570K
130/1570K
134/1570K
135/1570K
139/1570K
139/1570K
141/1570K
142/1570K
143/1570K
145/1570K
146/1570K
148/1570K
149/1570K
150/1570K
152/1570K
153/1570K
157/1570K
161/1570K
163/1570K
165/1570K
166/1570K
167/1570K
169/1570K
170/1570K
172/1570K
173/1570K
175/1570K
176/1570K
177/1570K
179/1570K
180/1570K
182/1570K
183/1570K
184/1570K
186/1570K
187/1570K
189/1570K
190/1570K
192/1570K
193/1570K
194/1570K
196/1570K
197/1570K
199/1570K
200/1570K
201/1570K
202/1570K
204/1570K
205/1570K
206/1570K
208/1570K
209/1570K
210/1570K
212/1570K
213/1570K
215/1570K
216/1570K
220/1570K
224/1570K
224/1570K
228/1570K
229/1570K
230/1570K
232/1570K
233/1570K
234/1570K
236/1570K
237/1570K
239/1570K
240/1570K
241/1570K
243/1570K
247/1570K
251/1570K
253/1570K
254/1570K
256/1570K
257/1570K
258/1570K
260/1570K
261/1570K
263/1570K
264/1570K
265/1570K
267/1570K
271/1570K
273/1570K
274/1570K
275/1570K
277/1570K
278/1570K
280/1570K
281/1570K
282/1570K
284/1570K
285/1570K
287/1570K
288/1570K
290/1570K
291/1570K
292/1570K
294/1570K
295/1570K
297/1570K
298/1570K
302/1570K
306/1570K
308/1570K
309/1570K
311/1570K
312/1570K
314/1570K
315/1570K
316/1570K
318/1570K
319/1570K
323/1570K
327/1570K
328/1570K
329/1570K
331/1570K
332/1570K
333/1570K
335/1570K
336/1570K
338/1570K
339/1570K
340/1570K
342/1570K
343/1570K
345/1570K
346/1570K
350/1570K
354/1570K
356/1570K
357/1570K
359/1570K
360/1570K
362/1570K
363/1570K
364/1570K
366/1570K
367/1570K
369/1570K
370/1570K
372/1570K
373/1570K
374/1570K
376/1570K
377/1570K
379/1570K
380/1570K
381/1570K
383/1570K
384/1570K
386/1570K
387/1570K
389/1570K
390/1570K
391/1570K
393/1570K
394/1570K
396/1570K
397/1570K
398/1570K
400/1570K
401/1570K
403/1570K
404/1570K
405/1570K
407/1570K
408/1570K
410/1570K
411/1570K
413/1570K
417/1570K
421/1570K
421/1570K
425/1570K
425/1570K
427/1570K
428/1570K
430/1570K
431/1570K
432/1570K
434/1570K
435/1570K
437/1570K
438/1570K
439/1570K
443/1570K
447/1570K
449/1570K
451/1570K
452/1570K
454/1570K
458/1570K
461/1570K
462/1570K
463/1570K
465/1570K
466/1570K
468/1570K
469/1570K
471/1570K
472/1570K
473/1570K
475/1570K
476/1570K
478/1570K
479/1570K
480/1570K
482/1570K
483/1570K
485/1570K
486/1570K
487/1570K
489/1570K
490/1570K
492/1570K
493/1570K
495/1570K
496/1570K
497/1570K
499/1570K
500/1570K
502/1570K
503/1570K
504/1570K
506/1570K
507/1570K
509/1570K
510/1570K
512/1570K
513/1570K
514/1570K
516/1570K
520/1570K
520/1570K
521/1570K
525/1570K
529/1570K
530/1570K
534/1570K
534/1570K
536/1570K
537/1570K
538/1570K
540/1570K
541/1570K
543/1570K
544/1570K
545/1570K
547/1570K
548/1570K
552/1570K
556/1570K
558/1570K
560/1570K
561/1570K
562/1570K
564/1570K
565/1570K
567/1570K
568/1570K
570/1570K
571/1570K
572/1570K
574/1570K
575/1570K
577/1570K
578/1570K
579/1570K
581/1570K
582/1570K
584/1570K
585/1570K
586/1570K
588/1570K
589/1570K
591/1570K
592/1570K
594/1570K
595/1570K
596/1570K
600/1570K
604/1570K
606/1570K
608/1570K
609/1570K
611/1570K
612/1570K
613/1570K
615/1570K
616/1570K
618/1570K
619/1570K
620/1570K
622/1570K
623/1570K
625/1570K
629/1570K
633/1570K
635/1570K
636/1570K
637/1570K
639/1570K
640/1570K
642/1570K
643/1570K
644/1570K
646/1570K
647/1570K
649/1570K
650/1570K
654/1570K
658/1570K
660/1570K
661/1570K
663/1570K
664/1570K
666/1570K
667/1570K
668/1570K
670/1570K
671/1570K
673/1570K
674/1570K
676/1570K
677/1570K
678/1570K
680/1570K
684/1570K
687/1570K
688/1570K
690/1570K
691/1570K
693/1570K
694/1570K
698/1570K
700/1570K
701/1570K
702/1570K
704/1570K
705/1570K
707/1570K
708/1570K
709/1570K
711/1570K
712/1570K
714/1570K
715/1570K
717/1570K
718/1570K
719/1570K
721/1570K
722/1570K
724/1570K
725/1570K
726/1570K
728/1570K
729/1570K
731/1570K
732/1570K
734/1570K
735/1570K
736/1570K
738/1570K
739/1570K
741/1570K
742/1570K
743/1570K
745/1570K
746/1570K
748/1570K
749/1570K
751/1570K
752/1570K
753/1570K
755/1570K
756/1570K
758/1570K
759/1570K
760/1570K
762/1570K
763/1570K
765/1570K
766/1570K
767/1570K
769/1570K
770/1570K
772/1570K
773/1570K
775/1570K
776/1570K
777/1570K
779/1570K
780/1570K
782/1570K
783/1570K
784/1570K
786/1570K
787/1570K
789/1570K
790/1570K
792/1570K
793/1570K
797/1570K
801/1570K
804/1570K
806/1570K
807/1570K
808/1570K
812/1570K
816/1570K
818/1570K
820/1570K
821/1570K
823/1570K
824/1570K
825/1570K
827/1570K
828/1570K
830/1570K
831/1570K
833/1570K
834/1570K
835/1570K
837/1570K
841/1570K
845/1570K
847/1570K
848/1570K
849/1570K
851/1570K
852/1570K
854/1570K
855/1570K
857/1570K
858/1570K
859/1570K
861/1570K
862/1570K
864/1570K
865/1570K
866/1570K
868/1570K
869/1570K
871/1570K
872/1570K
874/1570K
875/1570K
876/1570K
878/1570K
879/1570K
881/1570K
882/1570K
883/1570K
885/1570K
886/1570K
888/1570K
889/1570K
890/1570K
892/1570K
893/1570K
895/1570K
896/1570K
898/1570K
899/1570K
903/1570K
907/1570K
909/1570K
910/1570K
912/1570K
913/1570K
915/1570K
916/1570K
917/1570K
919/1570K
920/1570K
922/1570K
926/1570K
930/1570K
930/1570K
932/1570K
933/1570K
934/1570K
936/1570K
937/1570K
939/1570K
940/1570K
941/1570K
943/1570K
944/1570K
946/1570K
947/1570K
948/1570K
952/1570K
956/1570K
958/1570K
960/1570K
961/1570K
965/1570K
967/1570K
968/1570K
970/1570K
971/1570K
973/1570K
974/1570K
975/1570K
977/1570K
978/1570K
980/1570K
984/1570K
987/1570K
988/1570K
989/1570K
991/1570K
992/1570K
994/1570K
995/1570K
997/1570K
998/1570K
999/1570K
1001/1570K
1002/1570K
1004/1570K
1005/1570K
1009/1570K
1012/1570K
1014/1570K
1015/1570K
1016/1570K
1018/1570K
1019/1570K
1021/1570K
1022/1570K
1023/1570K
1025/1570K
1026/1570K
1028/1570K
1029/1570K
1030/1570K
1032/1570K
1033/1570K
1035/1570K
1036/1570K
1038/1570K
1039/1570K
1040/1570K
1042/1570K
1043/1570K
1045/1570K
1046/1570K
1048/1570K
1049/1570K
1050/1570K
1052/1570K
1053/1570K
1055/1570K
1056/1570K
1057/1570K
1059/1570K
1060/1570K
1062/1570K
1063/1570K
1064/1570K
1066/1570K
1067/1570K
1069/1570K
1070/1570K
1072/1570K
1073/1570K
1074/1570K
1076/1570K
1077/1570K
1079/1570K
1080/1570K
1081/1570K
1083/1570K
1084/1570K
1086/1570K
1087/1570K
1089/1570K
1090/1570K
1091/1570K
1093/1570K
1094/1570K
1096/1570K
1097/1570K
1098/1570K
1100/1570K
1101/1570K
1103/1570K
1104/1570K
1105/1570K
1107/1570K
1108/1570K
1110/1570K
1114/1570K
1118/1570K
1120/1570K
1121/1570K
1122/1570K
1124/1570K
1125/1570K
1127/1570K
1128/1570K
1132/1570K
1136/1570K
1137/1570K
1138/1570K
1139/1570K
1141/1570K
1142/1570K
1144/1570K
1145/1570K
1146/1570K
1148/1570K
1149/1570K
1151/1570K
1152/1570K
1154/1570K
1155/1570K
1156/1570K
1158/1570K
1159/1570K
1161/1570K
1162/1570K
1163/1570K
1165/1570K
1166/1570K
1168/1570K
1169/1570K
1171/1570K
1172/1570K
1173/1570K
1175/1570K
1176/1570K
1178/1570K
1179/1570K
1180/1570K
1183/1570K
1187/1570K
1191/1570K
1193/1570K
1195/1570K
1196/1570K
1197/1570K
1199/1570K
1200/1570K
1202/1570K
1203/1570K
1204/1570K
1206/1570K
1207/1570K
1210/1570K
1212/1570K
1213/1570K
1214/1570K
1216/1570K
1217/1570K
1221/1570K
1224/1570K
1226/1570K
1227/1570K
1229/1570K
1230/1570K
1231/1570K
1233/1570K
1234/1570K
1238/1570K
1238/1570K
1240/1570K
1244/1570K
1244/1570K
1245/1570K
1247/1570K
1248/1570K
1250/1570K
1251/1570K
1253/1570K
1254/1570K
1255/1570K
1257/1570K
1258/1570K
1262/1570K
1265/1570K
1267/1570K
1268/1570K
1270/1570K
1271/1570K
1275/1570K
1279/1570K
1279/1570K
1281/1570K
1282/1570K
1284/1570K
1285/1570K
1286/1570K
1288/1570K
1289/1570K
1291/1570K
1292/1570K
1294/1570K
1295/1570K
1296/1570K
1298/1570K
1299/1570K
1301/1570K
1302/1570K
1303/1570K
1305/1570K
1306/1570K
1308/1570K
1309/1570K
1311/1570K
1312/1570K
1313/1570K
1315/1570K
1318/1570K
1319/1570K
1320/1570K
1322/1570K
1323/1570K
1325/1570K
1326/1570K
1327/1570K
1329/1570K
1332/1570K
1333/1570K
1335/1570K
1339/1570K
1339/1570K
1340/1570K
1342/1570K
1343/1570K
1344/1570K
1346/1570K
1347/1570K
1349/1570K
1350/1570K
1352/1570K
1353/1570K
1354/1570K
1356/1570K
1357/1570K
1359/1570K
1360/1570K
1361/1570K
1363/1570K
1364/1570K
1366/1570K
1367/1570K
1368/1570K
1370/1570K
1371/1570K
1373/1570K
1374/1570K
1376/1570K
1377/1570K
1378/1570K
1380/1570K
1381/1570K
1383/1570K
1384/1570K
1385/1570K
1387/1570K
1388/1570K
1390/1570K
1391/1570K
1395/1570K
1395/1570K
1397/1570K
1400/1570K
1401/1570K
1402/1570K
1404/1570K
1405/1570K
1407/1570K
1408/1570K
1410/1570K
1411/1570K
1412/1570K
1414/1570K
1415/1570K
1417/1570K
1418/1570K
1419/1570K
1421/1570K
1422/1570K
1424/1570K
1425/1570K
1426/1570K
1428/1570K
1429/1570K
1431/1570K
1432/1570K
1434/1570K
1435/1570K
1436/1570K
1438/1570K
1439/1570K
1441/1570K
1442/1570K
1443/1570K
1445/1570K
1446/1570K
1448/1570K
1449/1570K
1451/1570K
1452/1570K
1453/1570K
1455/1570K
1456/1570K
1458/1570K
1459/1570K
1460/1570K
1462/1570K
1463/1570K
1465/1570K
1466/1570K
1467/1570K
1471/1570K
1475/1570K
1476/1570K
1480/1570K
1482/1570K
1483/1570K
1484/1570K
1486/1570K
1487/1570K
1489/1570K
1490/1570K
1492/1570K
1493/1570K
1494/1570K
1496/1570K
1497/1570K
1501/1570K
1504/1570K
1506/1570K
1507/1570K
1508/1570K
1510/1570K
1511/1570K
1513/1570K
1514/1570K
1516/1570K
1517/1570K
1518/1570K
1520/1570K
1521/1570K
1523/1570K
1524/1570K
1525/1570K
1527/1570K
1528/1570K
1530/1570K
1531/1570K
1533/1570K
1534/1570K
1535/1570K
1537/1570K
1538/1570K
1540/1570K
1541/1570K
1542/1570K
1544/1570K
1545/1570K
1547/1570K
1548/1570K
1549/1570K
1551/1570K
1552/1570K
1556/1570K
1560/1570K
1562/1570K
1564/1570K
1565/1570K
1566/1570K
1568/1570K
1570/1570K
1570K downloaded
build:start:

multiproject:install-callback:
    [echo] Running jar:install for Geronimo :: Axis
java:prepare-filesystem:

java:compile:
<depend closure="false" srcdir="1.4" dump="false" destdir="/home/continuum/build/work/1/modules/axis/target/classes"></depend>
   [echo] Compiling to /home/continuum/build/work/1/modules/axis/target/classes
Running post goal: java:compile
geronimo:dependency:


java:jar-resources:
Copying 1 file to /home/continuum/build/work/1/modules/axis/target/classes

test:prepare-filesystem:

test:test-resources:

test:compile:

test:test:
    [echo] NOTICE: Skipping tests; they seem to have passed already
    [echo] No tests to run.
Running post goal: test:test

jar:jar:
    [jar] Building jar: /home/continuum/build/work/1/modules/axis/target/geronimo-axis-1.0-SNAPSHOT.jar

jar:install:
    [echo] Installing...
Uploading to geronimo/jars/geronimo-axis-1.0-SNAPSHOT.jar: 
.................... (39K)
Uploading to geronimo/poms/geronimo-axis-1.0-SNAPSHOT.pom: 
.................... (12K)

+----------------------------------------
| geronimo and geronimo-plugins Geronimo :: Naming
| Memory: 10M/17M
+----------------------------------------
DEPRECATED: the default goal should be specified in the <build> section of project.xml
instead of maven.xml
DEPRECATED: the default goal should be specified in the <build> section of project.xml
instead of maven.xml

build:end:

build:start:

multiproject:install-callback:
    [echo] Running jar:install for Geronimo :: Naming
java:prepare-filesystem:

java:compile:
<depend closure="false" srcdir="1.4" dump="false" destdir="/home/continuum/build/work/1/modules/naming/target/classes"></depend>
   [echo] Compiling to /home/continuum/build/work/1/modules/naming/target/classes

java:jar-resources:

test:prepare-filesystem:

test:test-resources:

test:compile:

test:test:
    [echo] NOTICE: Skipping tests; they seem to have passed already
    [echo] No tests to run.
Running post goal: test:test

jar:jar:

jar:install:
    [echo] Installing...
Uploading to geronimo/jars/geronimo-naming-1.0-SNAPSHOT.jar: 
.................... (45K)
Uploading to geronimo/poms/geronimo-naming-1.0-SNAPSHOT.pom: 
.................... (9K)

+----------------------------------------
| geronimo and geronimo-plugins Geronimo :: Deploy :: Common Config
| Memory: 11M/17M
+----------------------------------------
DEPRECATED: the default goal should be specified in the <build> section of project.xml
instead of maven.xml
DEPRECATED: the default goal should be specified in the <build> section of project.xml
instead of maven.xml

build:end:

build:start:

multiproject:install-callback:
    [echo] Running jar:install for Geronimo :: Deploy :: Common Config
java:prepare-filesystem:

java:compile:
<depend closure="false" srcdir="1.4" dump="false" destdir="/home/continuum/build/work/1/modules/deploy-config/target/classes"></depend>
   [echo] Compiling to /home/continuum/build/work/1/modules/deploy-config/target/classes

java:jar-resources:

test:prepare-filesystem:

test:test-resources:

test:compile:

test:test:
    [echo] NOTICE: Skipping tests; they seem to have passed already
    [echo] No tests to run.
Running post goal: test:test

jar:jar:

jar:install:
    [echo] Installing...
Uploading to geronimo/jars/geronimo-deploy-config-1.0-SNAPSHOT.jar: 
.................... (10K)
Uploading to geronimo/poms/geronimo-deploy-config-1.0-SNAPSHOT.pom: 
.................... (10K)

+----------------------------------------
| geronimo and geronimo-plugins Geronimo :: Test :: DDBeans
| Memory: 11M/17M
+----------------------------------------
DEPRECATED: the default goal should be specified in the <build> section of project.xml
instead of maven.xml
DEPRECATED: the default goal should be specified in the <build> section of project.xml
instead of maven.xml

build:end:

build:start:

multiproject:install-callback:
    [echo] Running jar:install for Geronimo :: Test :: DDBeans
java:prepare-filesystem:

java:compile:
<depend closure="false" srcdir="1.4" dump="false" destdir="/home/continuum/build/work/1/modules/test-ddbean/target/classes"></depend>
   [echo] Compiling to /home/continuum/build/work/1/modules/test-ddbean/target/classes

java:jar-resources:

test:prepare-filesystem:

test:test-resources:

test:compile:

test:test:
    [echo] NOTICE: Skipping tests; they seem to have passed already
    [echo] No tests to run.
Running post goal: test:test

jar:jar:

jar:install:
    [echo] Installing...
Uploading to geronimo/jars/geronimo-test-ddbean-1.0-SNAPSHOT.jar: 
.................... (17K)
Uploading to geronimo/poms/geronimo-test-ddbean-1.0-SNAPSHOT.pom: 
.................... (10K)

+----------------------------------------
| geronimo and geronimo-plugins Geronimo :: Transaction
| Memory: 11M/17M
+----------------------------------------
DEPRECATED: the default goal should be specified in the <build> section of project.xml
instead of maven.xml

build:end:

build:start:

multiproject:install-callback:
    [echo] Running jar:install for Geronimo :: Transaction
java:prepare-filesystem:

java:compile:
<depend closure="false" srcdir="1.4" dump="false" destdir="/home/continuum/build/work/1/modules/transaction/target/classes"></depend>
   [echo] Compiling to /home/continuum/build/work/1/modules/transaction/target/classes

java:jar-resources:

test:prepare-filesystem:

test:test-resources:

test:compile:

test:test:
    [echo] NOTICE: Skipping tests; they seem to have passed already
    [echo] No tests to run.
Running post goal: test:test

jar:jar:

jar:install:
    [echo] Installing...
Uploading to geronimo/jars/geronimo-transaction-1.0-SNAPSHOT.jar: 
.................... (73K)
Uploading to geronimo/poms/geronimo-transaction-1.0-SNAPSHOT.pom: 
.................... (11K)

+----------------------------------------
| geronimo and geronimo-plugins Geronimo :: Connector
| Memory: 12M/17M
+----------------------------------------
DEPRECATED: the default goal should be specified in the <build> section of project.xml
instead of maven.xml
DEPRECATED: the default goal should be specified in the <build> section of project.xml
instead of maven.xml

build:end:

Attempting to download geronimo-naming-1.0-SNAPSHOT.jar.
Attempting to download geronimo-transaction-1.0-SNAPSHOT.jar.
build:start:

multiproject:install-callback:
    [echo] Running jar:install for Geronimo :: Connector
java:prepare-filesystem:

java:compile:
<depend closure="false" srcdir="1.4" dump="false" destdir="/home/continuum/build/work/1/modules/connector/target/classes"></depend>
   [echo] Compiling to /home/continuum/build/work/1/modules/connector/target/classes

java:jar-resources:

test:prepare-filesystem:

test:test-resources:

test:compile:

test:test:
    [echo] NOTICE: Skipping tests; they seem to have passed already
    [echo] No tests to run.
Running post goal: test:test

jar:jar:

jar:install:
    [echo] Installing...
Uploading to geronimo/jars/geronimo-connector-1.0-SNAPSHOT.jar: 
.................... (128K)
Uploading to geronimo/poms/geronimo-connector-1.0-SNAPSHOT.pom: 
.................... (12K)

+----------------------------------------
| geronimo and geronimo-plugins Geronimo :: Security :: Builder
| Memory: 14M/17M
+----------------------------------------
DEPRECATED: the default goal should be specified in the <build> section of project.xml
instead of maven.xml
DEPRECATED: the default goal should be specified in the <build> section of project.xml
instead of maven.xml

build:end:

Attempting to download geronimo-deploy-config-1.0-SNAPSHOT.jar.
build:start:

multiproject:install-callback:
    [echo] Running jar:install for Geronimo :: Security :: Builder
java:prepare-filesystem:

java:compile:
<depend closure="false" srcdir="1.4" dump="false" destdir="/home/continuum/build/work/1/modules/security-builder/target/classes"></depend>
   [echo] Compiling to /home/continuum/build/work/1/modules/security-builder/target/classes

java:jar-resources:

test:prepare-filesystem:

test:test-resources:
Running post goal: test:test-resources
    [delete] Deleting directory /home/continuum/build/work/1/modules/security-builder/target/database
    [mkdir] Created dir: /home/continuum/build/work/1/modules/security-builder/target/database

test:compile:
    [echo] No test source files to compile.

test:test:
    [echo] NOTICE: Skipping tests; they seem to have passed already
    [echo] No tests to run.
Running post goal: test:test

jar:jar:

jar:install:
    [echo] Installing...
Uploading to geronimo/jars/geronimo-security-builder-1.0-SNAPSHOT.jar: 
.................... (173K)
Uploading to geronimo/poms/geronimo-security-builder-1.0-SNAPSHOT.pom: 
.................... (11K)

+----------------------------------------
| geronimo and geronimo-plugins Geronimo :: J2EE
| Memory: 16M/17M
+----------------------------------------
DEPRECATED: the default goal should be specified in the <build> section of project.xml
instead of maven.xml
DEPRECATED: the default goal should be specified in the <build> section of project.xml
instead of maven.xml

build:end:

Attempting to download geronimo-security-builder-1.0-SNAPSHOT.jar.
build:start:

multiproject:install-callback:
    [echo] Running jar:install for Geronimo :: J2EE
java:prepare-filesystem:

java:compile:
<depend closure="false" srcdir="1.4" dump="false" destdir="/home/continuum/build/work/1/modules/j2ee-builder/target/classes"></depend>
   [echo] Compiling to /home/continuum/build/work/1/modules/j2ee-builder/target/classes

java:jar-resources:

test:prepare-filesystem:

test:test-resources:

test:compile:
setupEar:

setupEar:

setupUnpackedEar:
setupBaseUnpackedEar:

setupBaseUnpackedEar:

setupBaseUnpackedEar:



test:test:
    [echo] NOTICE: Skipping tests; they seem to have passed already
    [echo] No tests to run.
Running post goal: test:test

jar:jar:

jar:install:
    [echo] Installing...
Uploading to geronimo/jars/geronimo-j2ee-builder-1.0-SNAPSHOT.jar: 
.................... (94K)
Uploading to geronimo/poms/geronimo-j2ee-builder-1.0-SNAPSHOT.pom: 
.................... (12K)

+----------------------------------------
| geronimo and geronimo-plugins Geronimo :: Naming :: Builder
| Memory: 11M/19M
+----------------------------------------
DEPRECATED: the default goal should be specified in the <build> section of project.xml
instead of maven.xml
DEPRECATED: the default goal should be specified in the <build> section of project.xml
instead of maven.xml

build:end:

Attempting to download geronimo-j2ee-builder-1.0-SNAPSHOT.jar.
build:start:

multiproject:install-callback:
    [echo] Running jar:install for Geronimo :: Naming :: Builder
java:prepare-filesystem:

java:compile:
<depend closure="false" srcdir="1.4" dump="false" destdir="/home/continuum/build/work/1/modules/naming-builder/target/classes"></depend>
   [echo] Compiling to /home/continuum/build/work/1/modules/naming-builder/target/classes

java:jar-resources:

test:prepare-filesystem:

test:test-resources:

test:compile:

test:test:
    [echo] NOTICE: Skipping tests; they seem to have passed already
    [echo] No tests to run.
Running post goal: test:test

jar:jar:

jar:install:
    [echo] Installing...
Uploading to geronimo/jars/geronimo-naming-builder-1.0-SNAPSHOT.jar: 
.................... (174K)
Uploading to geronimo/poms/geronimo-naming-builder-1.0-SNAPSHOT.pom: 
.................... (12K)

+----------------------------------------
| geronimo and geronimo-plugins Geronimo :: Connector :: Builder
| Memory: 12M/19M
+----------------------------------------
DEPRECATED: the default goal should be specified in the <build> section of project.xml
instead of maven.xml
DEPRECATED: the default goal should be specified in the <build> section of project.xml
instead of maven.xml

build:end:

Attempting to download geronimo-test-ddbean-1.0-SNAPSHOT.jar.
Attempting to download geronimo-connector-1.0-SNAPSHOT.jar.
Attempting to download geronimo-naming-builder-1.0-SNAPSHOT.jar.
build:start:

multiproject:install-callback:
    [echo] Running jar:install for Geronimo :: Connector :: Builder
java:prepare-filesystem:

java:compile:
<depend closure="false" srcdir="1.4" dump="false" destdir="/home/continuum/build/work/1/modules/connector-builder/target/classes"></depend>
   [echo] Compiling to /home/continuum/build/work/1/modules/connector-builder/target/classes

java:jar-resources:

test:prepare-filesystem:

test:test-resources:

test:compile:

test:test:
    [junit] Running org.apache.geronimo.connector.deployment.ConnectorModuleBuilderTest
    [junit] Tests run: 8, Failures: 0, Errors: 6, Time elapsed: 4.975 sec
    [junit] [ERROR] Test org.apache.geronimo.connector.deployment.ConnectorModuleBuilderTest
FAILED
    [junit] Running org.apache.geronimo.connector.deployment.PlanParsingTest
    [junit] Tests run: 7, Failures: 0, Errors: 0, Time elapsed: 1.27 sec
    [junit] Running org.apache.geronimo.connector.deployment.RAR_1_0DConfigBeanTest
    [junit] Tests run: 1, Failures: 0, Errors: 0, Time elapsed: 0.345 sec
    [junit] Running org.apache.geronimo.connector.deployment.RAR_1_5DConfigBeanTest
    [junit] Tests run: 1, Failures: 0, Errors: 0, Time elapsed: 0.343 sec
    [junit] Running org.apache.geronimo.connector.deployment.jsr88.Connector15DCBTest
    [junit] Tests run: 1, Failures: 0, Errors: 0, Time elapsed: 1.248 sec

BUILD FAILED
File...... /home/continuum/build/work/1/maven.xml
Element... maven:reactor
Line...... 43
Column.... -1
Unable to obtain goal [multiproject:install-callback] -- /home/continuum/.maven/cache/maven-test-plugin-1.7/plugin.jelly:183:-1:
<fail> There were test failures.
Total time   : 1 minutes 34 seconds 
Finished at  : Friday, December 16, 2005 10:08:51 AM PST


****************************************************************************



Mime
View raw message