geronimo-scm mailing list archives

Site index · List index
Message view « Date » · « Thread »
Top « Date » · « Thread »
From i386-redhat-linux-gnu <dblev...@apache.org>
Subject build failed Wed Mar 16 07:04:09 PST 2005
Date Wed, 16 Mar 2005 15:04:11 GMT

==[SUMMARY]====================================

    [junit] [ERROR] TEST org.openejb.deployment.AxisWebServiceContainerBuilderTest FAILED
    [junit] [ERROR] TEST org.openejb.deployment.EarDeploymentTest FAILED
    [junit] [ERROR] TEST org.openejb.deployment.EjbJarModuleDeploymentTest FAILED
    [junit] [ERROR] TEST org.openejb.deployment.UnpackedModuleDeploymentTest FAILED

==[UPDATED]====================================

U  modules/axis/maven.xml
U  modules/axis/project.xml
A  modules/axis/src/test/org/apache/geronimo/axis/AxisResponse.java
A  modules/axis/src/test/org/apache/geronimo/axis/AxisWebServiceContainerTest.java
A  modules/axis/src/test/org/apache/geronimo/axis/testData
A  modules/axis/src/test/org/apache/geronimo/axis/testData/echosample
A  modules/axis/src/test/org/apache/geronimo/axis/testData/echosample/EchoStruct.java
A  modules/axis/src/test/org/apache/geronimo/axis/testData/echosample/EchoBean.java
A  modules/axis/src/test/org/apache/geronimo/axis/testData/echosample/SmallEchoStruct.java
A  modules/axis/src/test/org/apache/geronimo/axis/testData/echosample/Echo.java
A  modules/axis/src/test/org/apache/geronimo/axis/AxisRequest.java
U  modules/axis/src/java/org/apache/geronimo/axis/server/AxisWebServiceContainer.java
D  modules/axis/src/samples/echo-pojo/org/apache/ws/echosample
A  modules/axis/src/test-resources/echo.wsdl
A  modules/axis/src/test-resources/echoString-req.txt
A  modules/axis/src/test-resources/echo-deploy.wsdd


Mime
View raw message