geronimo-scm mailing list archives

Site index · List index
Message view « Date » · « Thread »
Top « Date » · « Thread »
From ia64-redhat-linux-gnu <dblev...@apache.org>
Subject build failed Tue Nov 9 13:52:08 PST 2004
Date Tue, 09 Nov 2004 21:52:08 GMT

==[SUMMARY]====================================

    [junit] [ERROR] TEST javax.enterprise.deploy.shared.factories.DeploymentFactoryManagerTest
FAILED
    [junit] [ERROR] TEST org.apache.geronimo.remoting.transport.AsyncTransportTest FAILED
    [junit] [ERROR] TEST org.apache.geronimo.remoting.RemotingInterceptorsTest FAILED
    [junit] [ERROR] TEST org.apache.geronimo.security.remoting.jmx.RemoteLoginTest FAILED
    [junit] [ERROR] TEST org.apache.geronimo.security.jaas.LoginSQLTest FAILED

==[UPDATED]====================================

U  modules/deployment/src/java/org/apache/geronimo/deployment/cli/ServerConnection.java
U  modules/timer/src/test/org/apache/geronimo/timer/jdbc/JDBCWorkerPersistenceTest.java
U  modules/common/src/test/org/apache/geronimo/common/propertyeditor/PropertyEditorsTest.java


Mime
View raw message