geronimo-scm mailing list archives

Site index · List index
Message view « Date » · « Thread »
Top « Date » · « Thread »
From ia64-redhat-linux-gnu <dblev...@apache.org>
Subject build failed Tue Nov 9 09:27:48 PST 2004
Date Tue, 09 Nov 2004 17:27:48 GMT

==[SUMMARY]====================================

    [junit] [ERROR] TEST javax.enterprise.deploy.shared.factories.DeploymentFactoryManagerTest
FAILED
    [junit] [ERROR] TEST org.apache.geronimo.common.propertyeditor.PropertyEditorsTest FAILED
    [junit] [ERROR] TEST org.apache.geronimo.remoting.transport.AsyncTransportTest FAILED
    [junit] [ERROR] TEST org.apache.geronimo.remoting.RemotingInterceptorsTest FAILED
    [junit] [ERROR] TEST org.apache.geronimo.security.remoting.jmx.RemoteLoginTest FAILED
    [junit] [ERROR] TEST org.apache.geronimo.security.jaas.LoginSQLTest FAILED
    [junit] [ERROR] TEST org.apache.geronimo.timer.jdbc.JDBCWorkerPersistenceTest FAILED
BUILD FAILED
BUILD FAILED

==[UPDATED]====================================




Mime
View raw message