geronimo-scm mailing list archives

Site index · List index
Message view « Date » · « Thread »
Top « Date » · « Thread »
From dblev...@apache.org
Subject [status] build: SUCCESSFUL, test: FAILED | FreeBSD 4.10-STABLE, 2004-08-22
Date Sun, 22 Aug 2004 09:51:07 GMT
NIGHTLY BUILD/TEST
  Date: Sun Aug 22 02:30:00 PDT 2004
  Kernel: FreeBSD 4.10-STABLE
  Host: minotaur.apache.org
  Java: 1.4.2-p6-brian_02_apr_2004_13_19, mixed mode
  Maven: 1.0

CHECKOUT: incubator-geronimo

BUILDING: incubator-geronimo
    [junit] [ERROR] TEST org.apache.geronimo.jetty.ApplicationTest FAILED
    [junit] [ERROR] TEST org.apache.geronimo.jetty.ContainerTest FAILED
    [junit] [ERROR] TEST org.apache.geronimo.jetty.SecurityTest FAILED
    [junit] [ERROR] TEST org.apache.geronimo.axis.AdminClientDeploymentTest FAILED
    [junit] [ERROR] TEST org.apache.geronimo.axis.AxisGBeanTest FAILED
    [junit] [ERROR] TEST org.apache.geronimo.axis.EchoHeadersTest FAILED
    [junit] [ERROR] TEST org.apache.geronimo.axis.WebServiceDeploymentTest FAILED
    [junit] [ERROR] TEST org.apache.geronimo.axis.WebServiceTest FAILED

BUILD SUCCESSFUL
Total time: 20 minutes 28 seconds
Finished at: Sun Aug 22 02:51:07 PDT 2004

Mime
View raw message