geronimo-scm mailing list archives

Site index · List index
Message view « Date » · « Thread »
Top « Date » · « Thread »
From dblev...@apache.org
Subject [status] build: FAILED, test: FAILED | FreeBSD 4.10-STABLE, 2004-07-31
Date Sat, 31 Jul 2004 09:44:18 GMT
NIGHTLY BUILD/TEST
  Date: Sat Jul 31 02:30:00 PDT 2004
  Kernel: FreeBSD 4.10-STABLE
  Host: minotaur.apache.org
  Java: 1.4.2-p6-brian_02_apr_2004_13_19, mixed mode
  Maven: 1.0

CHECKOUT: incubator-geronimo

BUILDING: incubator-geronimo
    [junit] [ERROR] TEST org.apache.geronimo.network.protocol.SocketProtocolStressTest FAILED
BUILD FAILED

BUILD FAILED
Total time: 13 minutes 24 seconds
Finished at: Sat Jul 31 02:44:18 PDT 2004

Mime
View raw message