geronimo-scm mailing list archives

Site index · List index
Message view « Date » · « Thread »
Top « Date » · « Thread »
From dblev...@apache.org
Subject [status] build: SUCCESSFUL, test: FAILED | FreeBSD 4.10-STABLE, 2004-07-29
Date Thu, 29 Jul 2004 19:11:22 GMT
NIGHTLY BUILD/TEST
  Date: Thu Jul 29 11:56:02 PDT 2004
  Kernel: FreeBSD 4.10-STABLE
  Host: minotaur.apache.org
  Java: 1.4.2-p6-brian_02_apr_2004_13_19, mixed mode
  Maven: 1.0

CHECKOUT: incubator-geronimo

BUILDING: incubator-geronimo
    [junit] [ERROR] TEST org.apache.geronimo.network.protocol.SocketProtocolStressTest FAILED
    [junit] [ERROR] TEST org.apache.geronimo.jetty.ApplicationTest FAILED
    [junit] [ERROR] TEST org.apache.geronimo.jetty.ContainerTest FAILED
    [junit] [ERROR] TEST org.apache.geronimo.jetty.SecurityTest FAILED
    [junit] [ERROR] TEST org.apache.geronimo.axis.AdminClientDeploymentTest FAILED
    [junit] [ERROR] TEST org.apache.geronimo.axis.AxisGBeanTest FAILED
    [junit] [ERROR] TEST org.apache.geronimo.axis.EchoHeadersTest FAILED
    [junit] [ERROR] TEST org.apache.geronimo.axis.WebServiceTest FAILED

BUILD SUCCESSFUL
Total time: 14 minutes 15 seconds
Finished at: Thu Jul 29 12:11:22 PDT 2004

Mime
View raw message