geronimo-scm mailing list archives

Site index · List index
Message view « Date » · « Thread »
Top « Date » · « Thread »
From dblev...@apache.org
Subject [status] build: , test: SUCCESSFUL | FreeBSD 4.10-STABLE, 2004-07-29
Date Thu, 29 Jul 2004 18:55:35 GMT
NIGHTLY BUILD/TEST
  Date: Thu Jul 29 02:30:00 PDT 2004
  Kernel: FreeBSD 4.10-STABLE
  Host: minotaur.apache.org
  Java: 1.4.2-p6-brian_02_apr_2004_13_19, mixed mode
  Maven: 1.0

CHECKOUT: incubator-geronimo

BUILDING: incubator-geronimo
bin/runbuild.sh: line 51: 28789 Terminated              maven -Dmaven.test.failure.ignore=true
>&results.log
grep: results.log: No such file or directory

tail: results.log: No such file or directory
xis.EchoHeadersTest FAILED
    [junit] [ERROR] TEST org.apache.geronimo.axis.WebServiceTest FAILED

BUILD SUCCESSFUL
Total time: 6 minutes 16 seconds
Finished at: Thu Jul 29 02:36:41 PDT 2004

Mime
View raw message