geronimo-scm mailing list archives

Site index · List index
Message view « Date » · « Thread »
Top « Date » · « Thread »
From dblev...@apache.org
Subject [status] build: FAILED, test: FAILED | Linux 2.4.26, 2004-07-25
Date Sun, 25 Jul 2004 09:37:00 GMT
NIGHTLY BUILD/TEST
  Date: Sun Jul 25 05:30:26 EDT 2004
  Kernel: Linux 2.4.26
  Host: beaver.codehaus.org
  Java: 1.4.2_04-b05, mixed mode
  Maven: 1.0-rc1-SNAPSHOT

CHECKOUT: incubator-geronimo

BUILDING: incubator-geronimo
    [junit] [ERROR] TEST javax.security.jacc.EJBMethodPermissionCollectionTest FAILED
BUILD FAILED

BUILD FAILED
Total time: 6 minutes 2 seconds
Finished at: Sun Jul 25 05:37:00 EDT 2004

Mime
View raw message