geronimo-scm mailing list archives

Site index · List index
Message view « Date » · « Thread »
Top « Date » · « Thread »
From dblev...@apache.org
Subject [status] build: FAILED, test: FAILED | FreeBSD 4.10-STABLE, 2004-07-15
Date Thu, 15 Jul 2004 09:41:28 GMT
NIGHTLY BUILD/TEST
  Date: Thu Jul 15 02:30:00 PDT 2004
  Kernel: FreeBSD 4.10-STABLE
  Host: minotaur.apache.org
  Java: 1.4.2-p6-brian_02_apr_2004_13_19, mixed mode
  Maven: 1.0-rc1-SNAPSHOT

CHECKOUT: incubator-geronimo

BUILDING: incubator-geronimo
    [junit] [ERROR] TEST org.apache.geronimo.connector.deployment.RAR_1_5ConfigBuilderTest
FAILED
    [junit] [ERROR] TEST org.apache.geronimo.jetty.ApplicationTest FAILED
    [junit] [ERROR] TEST org.apache.geronimo.jetty.SecurityTest FAILED
BUILD FAILED

BUILD FAILED
Total time: 9 minutes 35 seconds
Finished at: Thu Jul 15 02:41:28 PDT 2004

Mime
View raw message