geronimo-scm mailing list archives

Site index · List index
Message view « Date » · « Thread »
Top « Date » · « Thread »
From dblev...@apache.org
Subject [status] build: FAILED, test: FAILED | SunOS 5.8, 2004-07-15
Date Thu, 15 Jul 2004 09:40:00 GMT
NIGHTLY BUILD/TEST
  Date: Thu Jul 15 01:30:00 PDT 2004
  Kernel: SunOS 5.8
  Host: nagoya
  Java: 1.4.2_04-b05, mixed mode
  Maven: 1.0-rc1-SNAPSHOT

CHECKOUT: incubator-geronimo

BUILDING: incubator-geronimo
    [junit] [ERROR] TEST org.apache.geronimo.connector.deployment.RAR_1_5ConfigBuilderTest
FAILED
    [junit] [ERROR] TEST org.apache.geronimo.jetty.ApplicationTest FAILED
    [junit] [ERROR] TEST org.apache.geronimo.jetty.SecurityTest FAILED
BUILD FAILED

BUILD FAILED
Total time: 14 minutes 39 seconds
Finished at: Thu Jul 15 01:46:04 PDT 2004

Mime
View raw message