geronimo-scm mailing list archives

Site index · List index
Message view « Date » · « Thread »
Top « Date » · « Thread »
From dblev...@apache.org
Subject [status] build: FAILED, test: FAILED | Linux 2.4.24, 2004-07-15
Date Thu, 15 Jul 2004 09:39:23 GMT
NIGHTLY BUILD/TEST
  Date: Thu Jul 15 05:30:28 EDT 2004
  Kernel: Linux 2.4.24
  Host: beaver.codehaus.org
  Java: 1.4.2_04-b05, mixed mode
  Maven: 1.0-rc1-SNAPSHOT

CHECKOUT: incubator-geronimo

BUILDING: incubator-geronimo
    [junit] [ERROR] TEST org.apache.geronimo.connector.deployment.RAR_1_5ConfigBuilderTest
FAILED
BUILD FAILED

BUILD FAILED
Total time: 7 minutes 47 seconds
Finished at: Thu Jul 15 05:39:23 EDT 2004

Mime
View raw message