geronimo-scm mailing list archives

Site index · List index
Message view « Date » · « Thread »
Top « Date » · « Thread »
From dblev...@apache.org
Subject [status] build: SUCCESSFUL, test: FAILED | SunOS 5.8, 2004-06-21
Date Mon, 21 Jun 2004 09:40:00 GMT
NIGHTLY BUILD/TEST
  Date: Mon Jun 21 01:30:05 PDT 2004
  Kernel: SunOS 5.8
  Host: nagoya
  Java: 1.4.2_04-b05, mixed mode
  Maven: 1.0-rc1-SNAPSHOT

CHECKOUT: incubator-geronimo

BUILDING: incubator-geronimo
    [junit] [ERROR] TEST org.apache.geronimo.network.protocol.SocketProtocolStressTest FAILED

BUILD SUCCESSFUL
Total time: 23 minutes 49 seconds
Finished at: Mon Jun 21 01:56:23 PDT 2004

Mime
View raw message