geronimo-scm mailing list archives

Site index · List index
Message view « Date » · « Thread »
Top « Date » · « Thread »
From dblev...@apache.org
Subject [status] build: FAILED, test: FAILED | Linux 2.4.24, 2004-05-31
Date Mon, 31 May 2004 09:38:09 GMT
NIGHTLY BUILD/TEST
  Date: Mon May 31 05:30:26 EDT 2004
  Kernel: Linux 2.4.24
  Host: beaver.codehaus.org
  Java: 1.4.2_03-b02, mixed mode
  Maven: 1.0-rc1-SNAPSHOT

CHECKOUT: incubator-geronimo

BUILDING: incubator-geronimo
    [junit] [ERROR] TEST org.apache.geronimo.security.network.protocol.SubjectCarryingProtocolTest
FAILED
BUILD FAILED

BUILD FAILED
Total time: 6 minutes 38 seconds
Finished at: Mon May 31 05:38:09 EDT 2004

Mime
View raw message