geronimo-scm mailing list archives

Site index · List index
Message view « Date » · « Thread »
Top « Date » · « Thread »
From dblev...@apache.org
Subject [status] build: SUCCESSFUL, test: FAILED | Linux 2.4.24, 2004-04-29
Date Thu, 29 Apr 2004 09:47:42 GMT
NIGHTLY BUILD/TEST
  Date: Thu Apr 29 05:30:00 EDT 2004
  Kernel: Linux 2.4.24
  Host: beaver.codehaus.org
  Java: 1.4.2_03-b02, mixed mode
  Maven: 1.0-rc1-SNAPSHOT

CHECKOUT: incubator-geronimo

BUILDING: incubator-geronimo
    [junit] [ERROR] TEST org.apache.geronimo.jetty.ApplicationTest FAILED

BUILD SUCCESSFUL
Total time: 16 minutes 43 seconds
Finished at: Thu Apr 29 05:47:42 EDT 2004

Mime
View raw message