geronimo-scm mailing list archives

Site index · List index
Message view « Date » · « Thread »
Top « Date » · « Thread »
From dblev...@apache.org
Subject [status] build: , test: FAILED | Linux 2.4.24, 2004-04-26
Date Mon, 26 Apr 2004 09:57:00 GMT
NIGHTLY BUILD/TEST
  Date: Mon Apr 26 05:30:00 EDT 2004
  Kernel: Linux 2.4.24
  Host: beaver.codehaus.org
  Java: 1.4.2_03-b02, mixed mode
  Maven: 1.0-rc1-SNAPSHOT

CHECKOUT: incubator-geronimo

BUILDING: incubator-geronimo
    [junit] [ERROR] TEST org.apache.geronimo.connector.work.PooledWorkManagerTest FAILED
BUILD FAILED

Total time: 25 minutes 51 seconds
Finished at: Mon Apr 26 05:57:00 EDT 2004

Mime
View raw message