geronimo-scm mailing list archives

Site index · List index
Message view « Date » · « Thread »
Top « Date » · « Thread »
From dblev...@apache.org
Subject [status] build: SUCCESSFUL, test: FAILED | Linux 2.4.24, 2004-04-22
Date Thu, 22 Apr 2004 09:39:13 GMT
NIGHTLY BUILD/TEST
  Date: Thu Apr 22 05:30:00 EDT 2004
  Kernel: Linux 2.4.24
  Host: beaver.codehaus.org
  Java: 1.4.2_03-b02, mixed mode
  Maven: 1.0-rc1-SNAPSHOT

CHECKOUT: incubator-geronimo

BUILDING: incubator-geronimo
    [junit] [ERROR] TEST org.apache.geronimo.network.protocol.SocketProtocolStressTest FAILED

BUILD SUCCESSFUL
Total time: 7 minutes 54 seconds
Finished at: Thu Apr 22 05:39:13 EDT 2004

Mime
View raw message