geronimo-scm mailing list archives

Site index · List index
Message view « Date » · « Thread »
Top « Date » · « Thread »
From dblev...@apache.org
Subject [status] build: SUCCESSFUL, test: FAILED | FreeBSD 4.9-STABLE, 2004-03-13
Date Sat, 13 Mar 2004 10:36:57 GMT
NIGHTLY BUILD/TEST
  Date: Sat Mar 13 02:30:00 PST 2004
  Kernel: FreeBSD 4.9-STABLE
  Host: minotaur.apache.org
  Java: 1.4.2-p5-brian_16_nov_2003_15_49, mixed mode
  Maven: 1.0-rc1-SNAPSHOT

CHECKOUT: incubator-geronimo

BUILDING: incubator-geronimo
    [junit] [ERROR] TEST org.apache.geronimo.network.protocol.DatagramProtocolTest FAILED
    [junit] [ERROR] TEST org.apache.geronimo.security.network.protocol.SubjectCarryingProtocolTest
FAILED

BUILD SUCCESSFUL
Total time: 6 minutes 9 seconds
Finished at: Sat Mar 13 02:36:57 PST 2004

Mime
View raw message