geronimo-dev mailing list archives

Site index · List index
Message view « Date » · « Thread »
Top « Date » · « Thread »
From ga...@apache.org (Jarek Gawor)
Subject [BUILD] branches/2.2: Failed for Revision: 1174442
Date Fri, 23 Sep 2011 10:52:50 GMT
Geronimo Revision: 1174442 built with tests included
 
See the full build-2000.log file at http://people.apache.org/builds/geronimo/server/binaries/2.2/20110923/build-2000.log
 
Download the binaries from http://people.apache.org/builds/geronimo/server/binaries/2.2/20110923
[INFO] BUILD SUCCESSFUL
[INFO] ------------------------------------------------------------------------
[INFO] Total time: 434 minutes 15 seconds
[INFO] Finished at: Fri Sep 23 03:17:37 EDT 2011
[INFO] Final Memory: 314M/799M
[INFO] ------------------------------------------------------------------------
 
TESTSUITE RESULTS (Failures only)
=================================
 
Assembly: tomcat
=================================
See full test results and logs at http://people.apache.org/builds/geronimo/server/binaries/2.2/20110923/logs-2000-tomcat/
 
[INFO] Running TestSuite
[INFO] Tests run: 40, Failures: 23, Errors: 0, Skipped: 0, Time elapsed: 211.834 sec <<<
FAILURE!
[INFO] Running TestSuite
[INFO] Tests run: 12, Failures: 7, Errors: 0, Skipped: 0, Time elapsed: 71.963 sec <<<
FAILURE!
--
[INFO] Running TestSuite
[INFO] Tests run: 36, Failures: 1, Errors: 0, Skipped: 0, Time elapsed: 69.231 sec <<<
FAILURE!
 
Assembly: jetty
=================================
See full test results and logs at http://people.apache.org/builds/geronimo/server/binaries/2.2/20110923/logs-2000-jetty/
 
[INFO] Running TestSuite
[INFO] Tests run: 40, Failures: 28, Errors: 0, Skipped: 0, Time elapsed: 202.686 sec <<<
FAILURE!
[INFO] Running TestSuite
[INFO] Tests run: 12, Failures: 8, Errors: 0, Skipped: 0, Time elapsed: 84.742 sec <<<
FAILURE!
--
[INFO] Running TestSuite
[INFO] Tests run: 2, Failures: 2, Errors: 0, Skipped: 0, Time elapsed: 7.809 sec <<<
FAILURE!
 
[INFO] [INFO] [resources:testResources {execution: default-testResources}]
[INFO] [INFO] Using 'UTF-8' encoding to copy filtered resources.
[INFO] [INFO] Copying 1 resource
[INFO] [INFO] skip non existing resourceDirectory /home/geronimo/geronimo/2.2/testsuite/web-testsuite/test-jetty/src/test/filtered-resources
[INFO] [INFO] Copying 3 resources
[INFO] [INFO] [compiler:testCompile {execution: default-testCompile}]
[INFO] [INFO] Compiling 1 source file to /home/geronimo/geronimo/2.2/testsuite/web-testsuite/test-jetty/target/test-classes
[INFO] [INFO] [surefire:test {execution: default-test}]
[INFO] [INFO] Tests are skipped.
[INFO] [INFO] [war:war {execution: default-war}]
[INFO] [INFO] Packaging webapp
[INFO] [INFO] Assembling webapp[test-jetty] in [/home/geronimo/geronimo/2.2/testsuite/web-testsuite/test-jetty/target/test-jetty-2.2.2-SNAPSHOT]
[INFO] [INFO] Processing war project
[INFO] [INFO] Copying webapp webResources[/home/geronimo/geronimo/2.2/testsuite/web-testsuite/test-jetty/src/main/webapp]
to[/home/geronimo/geronimo/2.2/testsuite/web-testsuite/test-jetty/target/test-jetty-2.2.2-SNAPSHOT]
[INFO] [INFO] Copying webapp webResources[/home/geronimo/geronimo/2.2/testsuite/web-testsuite/test-jetty/target/classes]
to[/home/geronimo/geronimo/2.2/testsuite/web-testsuite/test-jetty/target/test-jetty-2.2.2-SNAPSHOT]
[INFO] [INFO] Copying webapp resources[/home/geronimo/geronimo/2.2/testsuite/web-testsuite/test-jetty/src/main/webapp]
[INFO] [INFO] Building jar: /home/geronimo/geronimo/2.2/testsuite/web-testsuite/test-jetty/target/test-jetty-2.2.2-SNAPSHOT/WEB-INF/lib/test-jetty-2.2.2-SNAPSHOT.jar
[INFO] [INFO] Webapp assembled in[225 msecs]
[INFO] [INFO] Building war: /home/geronimo/geronimo/2.2/testsuite/web-testsuite/test-jetty/target/test-jetty-2.2.2-SNAPSHOT.war
[INFO] [INFO] [selenium:start-server {execution: start}]
[INFO] Launching Selenium Server
[INFO] Waiting for Selenium Server...
[INFO] [INFO] Including display properties from: /home/geronimo/geronimo/2.2/testsuite/web-testsuite/test-jetty/target/selenium/display.properties
[INFO] [INFO] Redirecting output to: /home/geronimo/geronimo/2.2/testsuite/web-testsuite/test-jetty/target/selenium/server.log
[INFO] [INFO] User extensions: /home/geronimo/geronimo/2.2/testsuite/web-testsuite/test-jetty/target/selenium/user-extensions.js
[INFO] Selenium Server started
[INFO] [INFO] [geronimo:deploy-module {execution: deploy-wars}]
[INFO] [INFO] Using non-artifact based module archive: /home/geronimo/geronimo/2.2/testsuite/web-testsuite/test-jetty/target/test-jetty-2.2.2-SNAPSHOT.war
[INFO] [INFO] Distributing module artifact: /home/geronimo/geronimo/2.2/testsuite/web-testsuite/test-jetty/target/test-jetty-2.2.2-SNAPSHOT.war
[INFO] [INFO] Starting modules...
[INFO] [INFO] Starting module: org.apache.geronimo.testsuite/test-jetty/2.2.2-SNAPSHOT/car
[INFO] [INFO] Started module(s):
[INFO] [INFO]     [0] org.apache.geronimo.testsuite/test-jetty/2.2.2-SNAPSHOT/car
[INFO] [INFO] [failsafe:integration-test {execution: integration-test}]
[INFO] [INFO] Failsafe report directory: /home/geronimo/geronimo/2.2/testsuite/web-testsuite/test-jetty/target/failsafe-reports
[INFO] 
[INFO] -------------------------------------------------------
[INFO]  T E S T S
[INFO] -------------------------------------------------------
[INFO] Running TestSuite
[INFO] Tests run: 2, Failures: 0, Errors: 0, Skipped: 0, Time elapsed: 0.622 sec
[INFO] 
[INFO] Results :
[INFO] 
[INFO] Tests run: 2, Failures: 0, Errors: 0, Skipped: 0
[INFO] 
[INFO] [WARNING] File encoding has not been set, using platform encoding ANSI_X3.4-1968, i.e.
build is platform dependent!
[INFO] [INFO] [selenium:stop-server {execution: stop}]
[INFO] Stopping Selenium server...
[INFO] Stop request sent
[INFO] [INFO] [geronimo:undeploy-module {execution: undeploy-war-as-moduleId}]
[INFO] [INFO] Using non-artifact based module id: org.apache.geronimo.testsuite/test-jetty/2.2.2-SNAPSHOT/car
[INFO] [INFO] Stopping module: org.apache.geronimo.testsuite/test-jetty/2.2.2-SNAPSHOT/car
[INFO] [INFO] Stopped module(s):
[INFO] [INFO]     [0] org.apache.geronimo.testsuite/test-jetty/2.2.2-SNAPSHOT/car; URL: /JettyWeb
[INFO] [INFO] Undeploying module: org.apache.geronimo.testsuite/test-jetty/2.2.2-SNAPSHOT/car
[INFO] [INFO] Undeployed module(s):
[INFO] [INFO]     [0] org.apache.geronimo.testsuite/test-jetty/2.2.2-SNAPSHOT/car
[INFO] [INFO] [ianal:verify-legal-files {execution: default}]
[INFO] [WARNING] Skipping verification of legal files in artifacts:
[INFO] [WARNING]     org.apache.geronimo.testsuite:test-jetty:war:2.2.2-SNAPSHOT
[INFO] [INFO] [failsafe:verify {execution: verify}]
[INFO] [INFO] Failsafe report directory: /home/geronimo/geronimo/2.2/testsuite/web-testsuite/test-jetty/target/failsafe-reports
[INFO] [WARNING] File encoding has not been set, using platform encoding ANSI_X3.4-1968, i.e.
build is platform dependent!
[INFO] [INFO] [install:install {execution: default-install}]
[INFO] [INFO] Installing /home/geronimo/geronimo/2.2/testsuite/web-testsuite/test-jetty/target/test-jetty-2.2.2-SNAPSHOT.war
to /home/geronimo/.m2/repository/org/apache/geronimo/testsuite/test-jetty/2.2.2-SNAPSHOT/test-jetty-2.2.2-SNAPSHOT.war
[INFO] [INFO] ------------------------------------------------------------------------
[INFO] [INFO] BUILD SUCCESSFUL
[INFO] [INFO] ------------------------------------------------------------------------
[INFO] [INFO] Total time: 27 seconds
[INFO] [INFO] Finished at: Fri Sep 23 05:38:50 EDT 2011
[INFO] [INFO] Final Memory: 43M/551M
[INFO] [INFO] ------------------------------------------------------------------------
[INFO] Deleting: /tmp/Xvfb8554043363689488188.Xauthority
[INFO] [ianal:verify-legal-files {execution: default}]
[INFO] [install:install {execution: default-install}]
[INFO] Installing /home/geronimo/geronimo/2.2/testsuite/web-testsuite/pom.xml to /home/geronimo/.m2/repository/org/apache/geronimo/testsuite/web-testsuite/2.2.2-SNAPSHOT/web-testsuite-2.2.2-SNAPSHOT.pom
[INFO] [geronimo:stop-server {execution: stop}]
[INFO] Stopping Geronimo server...
[INFO] ------------------------------------------------------------------------
[INFO] Building Geronimo TestSuite :: WebServices TestSuite
[INFO]    task-segment: [install]
[INFO] ------------------------------------------------------------------------
[INFO] [genesis:validate-configuration {execution: default}]
[INFO] [enforcer:enforce {execution: default}]
[INFO] [remote-resources:process {execution: default}]
[INFO] [site:attach-descriptor {execution: default-attach-descriptor}]
[INFO] [install:install {execution: install-ahead}]
[INFO] Installing /home/geronimo/geronimo/2.2/testsuite/webservices-testsuite/pom.xml to /home/geronimo/.m2/repository/org/apache/geronimo/testsuite/webservices-testsuite/2.2.2-SNAPSHOT/webservices-testsuite-2.2.2-SNAPSHOT.pom
[INFO] [geronimo:start-server {execution: start}]
[INFO] Using assembly configuration: jetty
[INFO] Using assembly artifact: org.apache.geronimo.assemblies:geronimo-jetty7-javaee5:zip:bin:2.2.2-SNAPSHOT:provided
[INFO] Using geronimoHome: /home/geronimo/geronimo/2.2/testsuite/webservices-testsuite/target/geronimo-jetty7-javaee5-2.2.2-SNAPSHOT
[INFO] Installing assembly...
[INFO] Expanding: /home/geronimo/.m2/repository/org/apache/geronimo/assemblies/geronimo-jetty7-javaee5/2.2.2-SNAPSHOT/geronimo-jetty7-javaee5-2.2.2-SNAPSHOT-bin.zip
into /home/geronimo/geronimo/2.2/testsuite/webservices-testsuite/target
[INFO] Starting Geronimo server...
[INFO] Selected option set: default
[INFO] Redirecting output to: /home/geronimo/geronimo/2.2/testsuite/webservices-testsuite/target/geronimo-logs/org.apache.geronimo.mavenplugins.geronimo.server.StartServerMojo.log
[INFO] Waiting for Geronimo server...
[INFO] ------------------------------------------------------------------------
[ERROR] BUILD ERROR
 
Samples: branches/2.2
=================================
Log: http://people.apache.org/builds/geronimo/server/binaries/2.2/20110923/samples-2000.log
 
Build status: OK
 

Mime
View raw message