geronimo-dev mailing list archives

Site index · List index
Message view « Date » · « Thread »
Top « Date » · « Thread »
From ga...@apache.org (Jarek Gawor)
Subject [BUILD] branches/2.2: Failed for Revision: 1169972
Date Tue, 13 Sep 2011 10:08:56 GMT
Geronimo Revision: 1169972 built with tests included
 
See the full build-2000.log file at http://people.apache.org/builds/geronimo/server/binaries/2.2/20110913/build-2000.log
 
Download the binaries from http://people.apache.org/builds/geronimo/server/binaries/2.2/20110913
[INFO] BUILD SUCCESSFUL
[INFO] ------------------------------------------------------------------------
[INFO] Total time: 434 minutes 25 seconds
[INFO] Finished at: Tue Sep 13 03:27:45 EDT 2011
[INFO] Final Memory: 313M/744M
[INFO] ------------------------------------------------------------------------
 
TESTSUITE RESULTS (Failures only)
=================================
 
Assembly: tomcat
=================================
See full test results and logs at http://people.apache.org/builds/geronimo/server/binaries/2.2/20110913/logs-2000-tomcat/
 
[INFO] Running TestSuite
[INFO] Tests run: 40, Failures: 24, Errors: 0, Skipped: 0, Time elapsed: 207.63 sec <<<
FAILURE!
[INFO] Running TestSuite
[INFO] Tests run: 12, Failures: 7, Errors: 0, Skipped: 0, Time elapsed: 79.079 sec <<<
FAILURE!
--
[INFO] Running TestSuite
[INFO] Tests run: 36, Failures: 1, Errors: 0, Skipped: 0, Time elapsed: 69.29 sec <<<
FAILURE!
 
Assembly: jetty
=================================
See full test results and logs at http://people.apache.org/builds/geronimo/server/binaries/2.2/20110913/logs-2000-jetty/
 
 
Booting Geronimo Kernel (in Java 1.5.0_22)...
Module  1/74 org.apache.geronimo.framework/j2ee-system/2.2.2-SNAPSHOT/car                
                      started in   .000s
Module  2/74 org.apache.geronimo.framework/jee-specs/2.2.2-SNAPSHOT/car                  
                      started in   .000s
Module  3/74 org.apache.geronimo.plugins.classloaders/xbean-finder/2.2.2-SNAPSHOT/car    
                      started in   .000s
Module  4/74 org.apache.geronimo.framework/xmlbeans/2.2.2-SNAPSHOT/car                   
                      started in   .000s
Module  5/74 org.apache.geronimo.framework/rmi-naming/2.2.2-SNAPSHOT/car                 
                      started in   .224s
Module  6/74 org.apache.geronimo.plugins.classloaders/geronimo-javaee-deployment_1.1MR3_spec/2.2.2-SNAPSHOT/car
started in   .000s
Module  7/74 org.apache.geronimo.framework/plugin/2.2.2-SNAPSHOT/car                     
                      started in   .861s
Module  8/74 org.apache.geronimo.framework/geronimo-gbean-deployer/2.2.2-SNAPSHOT/car    
                      started in   .397s
Module  9/74 org.apache.geronimo.configs/j2ee-server/2.2.2-SNAPSHOT/car                  
                      started in   .062s
Module 10/74 org.apache.geronimo.framework/j2ee-security/2.2.2-SNAPSHOT/car              
                     2011-09-13 05:00:21,973 WARN  [ConfigurationUtil] Could not load gbean
org.apache.geronimo.framework/j2ee-security/2.2.2-SNAPSHOT/car?ServiceModule=org.apache.geronimo.framework/j2ee-security/2.2.2-SNAPSHOT/car,j2eeType=GBean,name=LoginConfiguration
org.apache.geronimo.gbean.InvalidConfigurationException: Could not load attribute class: javax.security.auth.login.Configuration$Parameters
	at org.apache.geronimo.gbean.runtime.GBeanAttribute.<init>(GBeanAttribute.java:209)
	at org.apache.geronimo.gbean.runtime.GBeanInstance.buildAttributes(GBeanInstance.java:367)
	at org.apache.geronimo.gbean.runtime.GBeanInstance.<init>(GBeanInstance.java:240)
	at org.apache.geronimo.kernel.basic.BasicKernel.loadGBean(BasicKernel.java:352)
	at org.apache.geronimo.kernel.config.ConfigurationUtil.startConfigurationGBeans(ConfigurationUtil.java:450)
	at org.apache.geronimo.kernel.config.KernelConfigurationManager.start(KernelConfigurationManager.java:190)
	at org.apache.geronimo.kernel.config.SimpleConfigurationManager.startConfiguration(SimpleConfigurationManager.java:546)
	at sun.reflect.NativeMethodAccessorImpl.invoke0(Native Method)
	at sun.reflect.NativeMethodAccessorImpl.invoke(NativeMethodAccessorImpl.java:39)
	at sun.reflect.DelegatingMethodAccessorImpl.invoke(DelegatingMethodAccessorImpl.java:25)
	at java.lang.reflect.Method.invoke(Method.java:592)
	at org.apache.geronimo.gbean.runtime.ReflectionMethodInvoker.invoke(ReflectionMethodInvoker.java:34)
	at org.apache.geronimo.gbean.runtime.GBeanOperation.invoke(GBeanOperation.java:130)
	at org.apache.geronimo.gbean.runtime.GBeanInstance.invoke(GBeanInstance.java:816)
	at org.apache.geronimo.gbean.runtime.RawInvoker.invoke(RawInvoker.java:57)
	at org.apache.geronimo.kernel.basic.RawOperationInvoker.invoke(RawOperationInvoker.java:35)
	at org.apache.geronimo.kernel.basic.ProxyMethodInterceptor.intercept(ProxyMethodInterceptor.java:96)
	at org.apache.geronimo.kernel.config.EditableConfigurationManager$$EnhancerByCGLIB$$37fa4d0b.startConfiguration(<generated>)
	at org.apache.geronimo.system.main.EmbeddedDaemon.doStartup(EmbeddedDaemon.java:204)
	at org.apache.geronimo.system.main.EmbeddedDaemon.execute(EmbeddedDaemon.java:87)
	at org.apache.geronimo.kernel.util.MainConfigurationBootstrapper.main(MainConfigurationBootstrapper.java:45)
	at org.apache.geronimo.cli.AbstractCLI.executeMain(AbstractCLI.java:65)
	at org.apache.geronimo.cli.daemon.DaemonCLI.main(DaemonCLI.java:30)
Caused by: java.lang.ClassNotFoundException: Could not load class javax.security.auth.login.Configuration$Parameters
from classloader: org.apache.geronimo.framework/j2ee-security/2.2.2-SNAPSHOT/car, destroyed
state: false
	at org.apache.geronimo.kernel.ClassLoading.loadClass(ClassLoading.java:226)
	at org.apache.geronimo.gbean.runtime.GBeanAttribute.<init>(GBeanAttribute.java:207)
	... 22 more
Server Startup failed

org.apache.geronimo.kernel.config.LifecycleException: start of org.apache.geronimo.framework/j2ee-security/2.2.2-SNAPSHOT/car
failed
	at org.apache.geronimo.kernel.config.SimpleConfigurationManager.startConfiguration(SimpleConfigurationManager.java:562)
	at sun.reflect.NativeMethodAccessorImpl.invoke0(Native Method)
	at sun.reflect.NativeMethodAccessorImpl.invoke(NativeMethodAccessorImpl.java:39)
	at sun.reflect.DelegatingMethodAccessorImpl.invoke(DelegatingMethodAccessorImpl.java:25)
	at java.lang.reflect.Method.invoke(Method.java:592)
	at org.apache.geronimo.gbean.runtime.ReflectionMethodInvoker.invoke(ReflectionMethodInvoker.java:34)
	at org.apache.geronimo.gbean.runtime.GBeanOperation.invoke(GBeanOperation.java:130)
	at org.apache.geronimo.gbean.runtime.GBeanInstance.invoke(GBeanInstance.java:816)
	at org.apache.geronimo.gbean.runtime.RawInvoker.invoke(RawInvoker.java:57)
	at org.apache.geronimo.kernel.basic.RawOperationInvoker.invoke(RawOperationInvoker.java:35)
	at org.apache.geronimo.kernel.basic.ProxyMethodInterceptor.intercept(ProxyMethodInterceptor.java:96)
	at org.apache.geronimo.kernel.config.EditableConfigurationManager$$EnhancerByCGLIB$$37fa4d0b.startConfiguration(<generated>)
	at org.apache.geronimo.system.main.EmbeddedDaemon.doStartup(EmbeddedDaemon.java:204)
	at org.apache.geronimo.system.main.EmbeddedDaemon.execute(EmbeddedDaemon.java:87)
	at org.apache.geronimo.kernel.util.MainConfigurationBootstrapper.main(MainConfigurationBootstrapper.java:45)
	at org.apache.geronimo.cli.AbstractCLI.executeMain(AbstractCLI.java:65)
	at org.apache.geronimo.cli.daemon.DaemonCLI.main(DaemonCLI.java:30)
Caused by: org.apache.geronimo.kernel.config.InvalidConfigException: Unknown start exception
	at org.apache.geronimo.kernel.config.ConfigurationUtil.startConfigurationGBeans(ConfigurationUtil.java:531)
	at org.apache.geronimo.kernel.config.KernelConfigurationManager.start(KernelConfigurationManager.java:190)
	at org.apache.geronimo.kernel.config.SimpleConfigurationManager.startConfiguration(SimpleConfigurationManager.java:546)
	... 16 more
Caused by: org.apache.geronimo.gbean.InvalidConfigurationException: Could not load attribute
class: javax.security.auth.login.Configuration$Parameters
	at org.apache.geronimo.gbean.runtime.GBeanAttribute.<init>(GBeanAttribute.java:209)
	at org.apache.geronimo.gbean.runtime.GBeanInstance.buildAttributes(GBeanInstance.java:367)
	at org.apache.geronimo.gbean.runtime.GBeanInstance.<init>(GBeanInstance.java:240)
	at org.apache.geronimo.kernel.basic.BasicKernel.loadGBean(BasicKernel.java:352)
	at org.apache.geronimo.kernel.config.ConfigurationUtil.startConfigurationGBeans(ConfigurationUtil.java:450)
	... 18 more
Caused by: java.lang.ClassNotFoundException: Could not load class javax.security.auth.login.Configuration$Parameters
from classloader: org.apache.geronimo.framework/j2ee-security/2.2.2-SNAPSHOT/car, destroyed
state: false
	at org.apache.geronimo.kernel.ClassLoading.loadClass(ClassLoading.java:226)
	at org.apache.geronimo.gbean.runtime.GBeanAttribute.<init>(GBeanAttribute.java:207)
	... 22 more
 
[INFO] Scanning for projects...
[INFO] Reactor build order: 
[INFO]   Geronimo TestSuite
[INFO]   Geronimo TestSuite :: Commands TestSuite
[INFO]   Geronimo TestSuite :: Concurrent TestSuite
[INFO]   Geronimo TestSuite :: Console Testsuite
[INFO]   Geronimo TestSuite :: CORBA TestSuite
[INFO]   Geronimo TestSuite :: Deployment Testsuite
[INFO]   Geronimo TestSuite :: Enterprise Testsuite
[INFO]   Geronimo TestSuite :: Security Testsuite
[INFO]   Geronimo TestSuite :: Web-tier Testsuite
[INFO]   Geronimo TestSuite :: WebServices TestSuite
[INFO] ------------------------------------------------------------------------
[INFO] Building Geronimo TestSuite
[INFO]    task-segment: [install]
[INFO] ------------------------------------------------------------------------
[INFO] [genesis:validate-configuration {execution: default}]
[INFO] [enforcer:enforce {execution: default}]
[INFO] Setting property: classpath.resource.loader.class => 'org.codehaus.plexus.velocity.ContextClassLoaderResourceLoader'.
[INFO] Setting property: velocimacro.messages.on => 'false'.
[INFO] Setting property: resource.loader => 'classpath'.
[INFO] Setting property: resource.manager.logwhenfound => 'false'.
[INFO] [remote-resources:process {execution: default}]
[INFO] [site:attach-descriptor {execution: default-attach-descriptor}]
[INFO] [ianal:verify-legal-files {execution: default}]
[INFO] [install:install {execution: default-install}]
[INFO] Installing /home/geronimo/geronimo/2.2/testsuite/pom.xml to /home/geronimo/.m2/repository/org/apache/geronimo/testsuite/testsuite/2.2.2-SNAPSHOT/testsuite-2.2.2-SNAPSHOT.pom
[INFO] ------------------------------------------------------------------------
[INFO] Building Geronimo TestSuite :: Commands TestSuite
[INFO]    task-segment: [install]
[INFO] ------------------------------------------------------------------------
[INFO] [genesis:validate-configuration {execution: default}]
[INFO] [enforcer:enforce {execution: default}]
[INFO] [remote-resources:process {execution: default}]
[INFO] [site:attach-descriptor {execution: default-attach-descriptor}]
[INFO] [geronimo:start-server {execution: start}]
[INFO] Using assembly configuration: jetty
[INFO] snapshot org.apache.geronimo.assemblies:geronimo-jetty7-javaee5:2.2.2-SNAPSHOT: checking
for updates from codehaus.snapshots
[INFO] snapshot org.apache.geronimo.assemblies:geronimo-jetty7-javaee5:2.2.2-SNAPSHOT: checking
for updates from apache.snapshots
Downloading: http://repository.apache.org/snapshots/org/apache/geronimo/assemblies/geronimo-jetty7-javaee5/2.2.2-SNAPSHOT/geronimo-jetty7-javaee5-2.2.2-20110913.072316-6-bin.zip
113179K downloaded  (geronimo-jetty7-javaee5-2.2.2-20110913.072316-6-bin.zip)
[INFO] Using assembly artifact: org.apache.geronimo.assemblies:geronimo-jetty7-javaee5:zip:bin:2.2.2-SNAPSHOT:provided
[INFO] Using geronimoHome: /home/geronimo/geronimo/2.2/testsuite/commands-testsuite/target/geronimo-jetty7-javaee5-2.2.2-SNAPSHOT
[INFO] Installing assembly...
[INFO] Expanding: /home/geronimo/.m2/repository/org/apache/geronimo/assemblies/geronimo-jetty7-javaee5/2.2.2-SNAPSHOT/geronimo-jetty7-javaee5-2.2.2-SNAPSHOT-bin.zip
into /home/geronimo/geronimo/2.2/testsuite/commands-testsuite/target
[INFO] Starting Geronimo server...
[INFO] Selected option set: default
[INFO] Redirecting output to: /home/geronimo/geronimo/2.2/testsuite/commands-testsuite/target/geronimo-logs/org.apache.geronimo.mavenplugins.geronimo.server.StartServerMojo.log
[INFO] Waiting for Geronimo server...
[INFO] ------------------------------------------------------------------------
[ERROR] BUILD ERROR
 
Samples: branches/2.2
=================================
Log: http://people.apache.org/builds/geronimo/server/binaries/2.2/20110913/samples-2000.log
 
Build status: OK
 

Mime
View raw message