geronimo-dev mailing list archives

Site index · List index
Message view « Date » · « Thread »
Top « Date » · « Thread »
From ga...@apache.org (Jarek Gawor)
Subject [BUILD] branches/2.1: Failed for Revision: 1140440
Date Tue, 28 Jun 2011 10:53:30 GMT
Geronimo Revision: 1140440 built with tests included
 
See the full build-0200.log file at http://people.apache.org/builds/geronimo/server/binaries/2.1/20110628/build-0200.log
 
Download the binaries from http://people.apache.org/builds/geronimo/server/binaries/2.1/20110628
[INFO] BUILD SUCCESSFUL
[INFO] ------------------------------------------------------------------------
[INFO] Total time: 262 minutes 19 seconds
[INFO] Finished at: Tue Jun 28 06:26:23 EDT 2011
[INFO] Final Memory: 311M/831M
[INFO] ------------------------------------------------------------------------
 
TESTSUITE RESULTS (Failures only)
=================================
 
Assembly: tomcat
=================================
See full test results and logs at http://people.apache.org/builds/geronimo/server/binaries/2.1/20110628/logs-0200-tomcat/
 
 
[INFO] snapshot org.apache.geronimo.buildsupport:buildsupport:2.1.8-SNAPSHOT: checking for
updates from codehaus.snapshots
Downloading: http://repository.apache.org/snapshots/org/apache/geronimo/buildsupport/buildsupport/2.1.8-SNAPSHOT/buildsupport-2.1.8-20110628.031703-7.pom
2K downloaded  (buildsupport-2.1.8-20110628.031703-7.pom)
Downloading: http://repository.apache.org/snapshots/org/apache/geronimo/buildsupport/testsuite-maven-plugin/2.1.8-SNAPSHOT/testsuite-maven-plugin-2.1.8-20110628.031703-7.jar
36K downloaded  (testsuite-maven-plugin-2.1.8-20110628.031703-7.jar)
[INFO] [genesis:validate-configuration {execution: default}]
[INFO] snapshot org.apache.geronimo.testsupport:testsupport-selenium:2.1.8-SNAPSHOT: checking
for updates from codehaus.snapshots
[INFO] snapshot org.apache.geronimo.testsupport:testsupport-selenium:2.1.8-SNAPSHOT: checking
for updates from apache.snapshots
[INFO] snapshot org.apache.geronimo.testsupport:testsupport:2.1.8-SNAPSHOT: checking for updates
from openqa-snapshots
[INFO] snapshot org.apache.geronimo.testsupport:testsupport-common:2.1.8-SNAPSHOT: checking
for updates from openqa-snapshots
[INFO] [enforcer:enforce {execution: default}]
[INFO] Setting property: classpath.resource.loader.class => 'org.codehaus.plexus.velocity.ContextClassLoaderResourceLoader'.
[INFO] Setting property: velocimacro.messages.on => 'false'.
[INFO] Setting property: resource.loader => 'classpath'.
[INFO] Setting property: resource.manager.logwhenfound => 'false'.
[INFO] [remote-resources:process {execution: default}]
[INFO] [site:attach-descriptor {execution: default-attach-descriptor}]
[INFO] [ianal:verify-legal-files {execution: default}]
[INFO] [install:install {execution: default-install}]
[INFO] Installing /home/geronimo/geronimo/2.1/testsuite/pom.xml to /home/geronimo/.m2/repository/org/apache/geronimo/testsuite/testsuite/2.1.8-SNAPSHOT/testsuite-2.1.8-SNAPSHOT.pom
[INFO] ------------------------------------------------------------------------
[INFO] Building Geronimo TestSuite :: Commands TestSuite
[INFO]    task-segment: [install]
[INFO] ------------------------------------------------------------------------
Downloading: http://repo2.maven.org/maven2/org/codehaus/mojo/selenium-maven-plugin/1.0.1/selenium-maven-plugin-1.0.1.pom
[WARNING] Unable to get resource 'org.codehaus.mojo:selenium-maven-plugin:pom:1.0.1' from
repository central (http://repo1.maven.org/maven2): Error transferring file: Connection timed
out
Downloading: http://repo2.maven.org/maven2/org/codehaus/mojo/selenium-maven-plugin/1.0.1/selenium-maven-plugin-1.0.1.pom

Downloading: http://repo2.maven.org/maven2/org/codehaus/mojo/mojo-parent/23/mojo-parent-23.pom

Downloading: http://repo2.maven.org/maven2/org/codehaus/mojo/selenium-maven-plugin/1.0.1/selenium-maven-plugin-1.0.1.jar

Downloading: http://repo2.maven.org/maven2/org/apache/geronimo/genesis/plugins/maven-maven-plugin/1.3/maven-maven-plugin-1.3.pom

Downloading: http://repo2.maven.org/maven2/org/apache/geronimo/genesis/plugins/plugins/1.3/plugins-1.3.pom

Downloading: http://repo2.maven.org/maven2/org/apache/geronimo/genesis/plugins/maven-maven-plugin/1.3/maven-maven-plugin-1.3.jar

[INFO] [genesis:validate-configuration {execution: default}]
[INFO] snapshot org.apache.geronimo.testsupport:testsupport-commands:2.1.8-SNAPSHOT: checking
for updates from codehaus.snapshots
[INFO] snapshot org.apache.geronimo.testsupport:testsupport-commands:2.1.8-SNAPSHOT: checking
for updates from apache.snapshots
Downloading: http://repo2.maven.org/maven2/woodstox/wstx-asl/3.2.1/wstx-asl-3.2.1.pom
[INFO] Unable to find resource 'woodstox:wstx-asl:pom:3.2.1' in repository central (http://repo1.maven.org/maven2)
[INFO] [enforcer:enforce {execution: default}]
[INFO] [remote-resources:process {execution: default}]
Downloading: http://repo2.maven.org/maven2/org/codehaus/groovy/maven/gmaven-mojo/1.0-rc-4/gmaven-mojo-1.0-rc-4.pom

Downloading: http://repo2.maven.org/maven2/org/codehaus/groovy/maven/gmaven/1.0-rc-4/gmaven-1.0-rc-4.pom

Downloading: http://repo2.maven.org/maven2/org/codehaus/groovy/maven/runtime/gmaven-runtime-api/1.0-rc-4/gmaven-runtime-api-1.0-rc-4.pom

Downloading: http://repo2.maven.org/maven2/org/codehaus/groovy/maven/runtime/gmaven-runtime/1.0-rc-4/gmaven-runtime-1.0-rc-4.pom

Downloading: http://repo2.maven.org/maven2/org/codehaus/groovy/maven/feature/gmaven-feature-api/1.0-rc-4/gmaven-feature-api-1.0-rc-4.pom

Downloading: http://repo2.maven.org/maven2/org/codehaus/groovy/maven/feature/gmaven-feature/1.0-rc-4/gmaven-feature-1.0-rc-4.pom

Downloading: http://repo2.maven.org/maven2/org/codehaus/groovy/maven/runtime/gmaven-runtime-1.5/1.0-rc-4/gmaven-runtime-1.5-1.0-rc-4.pom

Downloading: http://repo2.maven.org/maven2/org/slf4j/slf4j-api/1.5.6/slf4j-api-1.5.6.pom

Downloading: http://repo2.maven.org/maven2/org/slf4j/slf4j-parent/1.5.6/slf4j-parent-1.5.6.pom

Downloading: http://repo2.maven.org/maven2/org/codehaus/groovy/maven/feature/gmaven-feature-support/1.0-rc-4/gmaven-feature-support-1.0-rc-4.pom

Downloading: http://repo2.maven.org/maven2/org/codehaus/groovy/maven/runtime/gmaven-runtime-support/1.0-rc-4/gmaven-runtime-support-1.0-rc-4.pom

Downloading: http://repo2.maven.org/maven2/org/codehaus/groovy/maven/gmaven-common/1.0-rc-4/gmaven-common-1.0-rc-4.pom

Downloading: http://repo2.maven.org/maven2/org/codehaus/groovy/maven/gmaven-mojo-support/1.0-rc-4/gmaven-mojo-support-1.0-rc-4.pom

Downloading: http://repo2.maven.org/maven2/commons-lang/commons-lang/2.4/commons-lang-2.4.pom

Downloading: http://repo2.maven.org/maven2/org/apache/commons/commons-parent/9/commons-parent-9.pom

Downloading: http://repo2.maven.org/maven2/org/codehaus/groovy/maven/feature/gmaven-feature-api/1.0-rc-4/gmaven-feature-api-1.0-rc-4.jar
Downloading: http://repo2.maven.org/maven2/org/codehaus/groovy/maven/runtime/gmaven-runtime-api/1.0-rc-4/gmaven-runtime-api-1.0-rc-4.jar
Downloading: http://repo2.maven.org/maven2/org/slf4j/slf4j-api/1.5.6/slf4j-api-1.5.6.jar
Downloading: http://repo2.maven.org/maven2/org/codehaus/groovy/maven/gmaven-mojo/1.0-rc-4/gmaven-mojo-1.0-rc-4.jar
Downloading: http://repo2.maven.org/maven2/commons-lang/commons-lang/2.4/commons-lang-2.4.jar

Downloading: http://repo2.maven.org/maven2/org/codehaus/groovy/maven/feature/gmaven-feature-support/1.0-rc-4/gmaven-feature-support-1.0-rc-4.jar

[WARNING] Unable to get resource 'org.slf4j:slf4j-api:jar:1.5.6' from repository central (http://repo1.maven.org/maven2):
Error transferring file: Connection timed out
[WARNING] Unable to get resource 'org.codehaus.groovy.maven:gmaven-mojo:jar:1.0-rc-4' from
repository central (http://repo1.maven.org/maven2): Error transferring file: Connection timed
out
[WARNING] Unable to get resource 'org.codehaus.groovy.maven.runtime:gmaven-runtime-api:jar:1.0-rc-4'
from repository central (http://repo1.maven.org/maven2): Error transferring file: Connection
timed out
Downloading: http://repo2.maven.org/maven2/org/codehaus/groovy/maven/gmaven-mojo/1.0-rc-4/gmaven-mojo-1.0-rc-4.jar
[WARNING] Unable to get resource 'commons-lang:commons-lang:jar:2.4' from repository central
(http://repo1.maven.org/maven2): Error transferring file: Connection timed out
Downloading: http://repo2.maven.org/maven2/org/codehaus/groovy/maven/runtime/gmaven-runtime-1.5/1.0-rc-4/gmaven-runtime-1.5-1.0-rc-4.jar
Downloading: http://repo2.maven.org/maven2/commons-lang/commons-lang/2.4/commons-lang-2.4.jar

Downloading: http://repo2.maven.org/maven2/org/codehaus/groovy/maven/gmaven-common/1.0-rc-4/gmaven-common-1.0-rc-4.jar

Downloading: http://repo2.maven.org/maven2/org/codehaus/groovy/maven/gmaven-mojo-support/1.0-rc-4/gmaven-mojo-support-1.0-rc-4.jar

Downloading: http://repo2.maven.org/maven2/org/codehaus/groovy/maven/runtime/gmaven-runtime-support/1.0-rc-4/gmaven-runtime-support-1.0-rc-4.jar



[INFO] ------------------------------------------------------------------------
[ERROR] BUILD ERROR
 
Assembly: jetty
=================================
See full test results and logs at http://people.apache.org/builds/geronimo/server/binaries/2.1/20110628/logs-0200-jetty/
 
[INFO] Running security-testsuite-generic-auth-test
[INFO] Tests run: 4, Failures: 3, Errors: 0, Skipped: 0, Time elapsed: 0.461 sec <<<
FAILURE!
 
Samples: branches/2.1
=================================
Log: http://people.apache.org/builds/geronimo/server/binaries/2.1/20110628/samples-0200.log
 
Build status: FAILED
 

Mime
View raw message