geronimo-dev mailing list archives

Site index · List index
Message view « Date » · « Thread »
Top « Date » · « Thread »
From ga...@apache.org (Jarek Gawor)
Subject [BUILD] branches/2.1: Failed for Revision: 1139155
Date Fri, 24 Jun 2011 12:43:03 GMT
Geronimo Revision: 1139155 built with tests included
 
See the full build-0200.log file at http://people.apache.org/builds/geronimo/server/binaries/2.1/20110624/build-0200.log
 
Download the binaries from http://people.apache.org/builds/geronimo/server/binaries/2.1/20110624
[INFO] BUILD SUCCESSFUL
[INFO] ------------------------------------------------------------------------
[INFO] Total time: 268 minutes 57 seconds
[INFO] Finished at: Fri Jun 24 06:33:44 EDT 2011
[INFO] Final Memory: 311M/827M
[INFO] ------------------------------------------------------------------------
 
TESTSUITE RESULTS (Failures only)
=================================
 
Assembly: tomcat
=================================
See full test results and logs at http://people.apache.org/builds/geronimo/server/binaries/2.1/20110624/logs-0200-tomcat/
 
[INFO] Running security-testsuite.security
[INFO] Tests run: 36, Failures: 1, Errors: 0, Skipped: 0, Time elapsed: 60.116 sec <<<
FAILURE!
 
Assembly: jetty
=================================
See full test results and logs at http://people.apache.org/builds/geronimo/server/binaries/2.1/20110624/logs-0200-jetty/
 
 
[INFO] [INFO] Unable to find resource 'org.apache.xbean:xbean-finder:jar:3.6' in repository
openejb-3rdparty-builds (http://svn.apache.org/repos/asf/openejb/repo/)
[INFO] Downloading: http://download.java.net/maven/1//org.apache.xbean/jars/xbean-finder-3.6.jar
[INFO] [INFO] Unable to find resource 'org.apache.xbean:xbean-finder:jar:3.6' in repository
java.net (http://download.java.net/maven/1)
[INFO] Downloading: http://repo2.maven.org/maven2/org/apache/xbean/xbean-finder/3.6/xbean-finder-3.6.jar
[INFO] 
[INFO] Downloading: http://repository.apache.org/snapshots/org/apache/geronimo/framework/geronimo-core/2.1.8-SNAPSHOT/geronimo-core-2.1.8-20110623.052743-4.jar
[INFO] 
[INFO] 22K downloaded  (geronimo-core-2.1.8-20110623.052743-4.jar)
[INFO] Downloading: http://repo2.maven.org/maven2/org/apache/geronimo/specs/geronimo-j2ee-management_1.1_spec/1.0.1/geronimo-j2ee-management_1.1_spec-1.0.1.jar
[INFO] Downloading: http://people.apache.org/repo/m2-incubating-repository/org/apache/geronimo/components/geronimo-transaction/2.2.1/geronimo-transaction-2.2.1.jar
[INFO] [INFO] Unable to find resource 'org.apache.geronimo.components:geronimo-transaction:jar:2.2.1'
in repository apache-incubating-repository (http://people.apache.org/repo/m2-incubating-repository)
[INFO] Downloading: http://tomcat.apache.org/dev/dist/m2-repository/org/apache/geronimo/components/geronimo-transaction/2.2.1/geronimo-transaction-2.2.1.jar
[INFO] [INFO] Unable to find resource 'org.apache.geronimo.components:geronimo-transaction:jar:2.2.1'
in repository tomcat-private-repository (http://tomcat.apache.org/dev/dist/m2-repository)
[INFO] Downloading: http://svn.apache.org/repos/asf/openejb/repo//org/apache/geronimo/components/geronimo-transaction/2.2.1/geronimo-transaction-2.2.1.jar
[INFO] [INFO] Unable to find resource 'org.apache.geronimo.components:geronimo-transaction:jar:2.2.1'
in repository openejb-3rdparty-builds (http://svn.apache.org/repos/asf/openejb/repo/)
[INFO] Downloading: http://download.java.net/maven/1//org.apache.geronimo.components/jars/geronimo-transaction-2.2.1.jar
[INFO] [INFO] Unable to find resource 'org.apache.geronimo.components:geronimo-transaction:jar:2.2.1'
in repository java.net (http://download.java.net/maven/1)
[INFO] Downloading: http://repo2.maven.org/maven2/org/apache/geronimo/components/geronimo-transaction/2.2.1/geronimo-transaction-2.2.1.jar
[INFO] 
[INFO] Downloading: http://people.apache.org/repo/m2-incubating-repository/org/apache/openejb/openejb-loader/3.0.3/openejb-loader-3.0.3.jar
[INFO] [INFO] Unable to find resource 'org.apache.openejb:openejb-loader:jar:3.0.3' in repository
apache-incubating-repository (http://people.apache.org/repo/m2-incubating-repository)
[INFO] Downloading: http://tomcat.apache.org/dev/dist/m2-repository/org/apache/openejb/openejb-loader/3.0.3/openejb-loader-3.0.3.jar
[INFO] [INFO] Unable to find resource 'org.apache.openejb:openejb-loader:jar:3.0.3' in repository
tomcat-private-repository (http://tomcat.apache.org/dev/dist/m2-repository)
[INFO] Downloading: http://svn.apache.org/repos/asf/openejb/repo//org/apache/openejb/openejb-loader/3.0.3/openejb-loader-3.0.3.jar
[INFO] [INFO] Unable to find resource 'org.apache.openejb:openejb-loader:jar:3.0.3' in repository
openejb-3rdparty-builds (http://svn.apache.org/repos/asf/openejb/repo/)
[INFO] Downloading: http://download.java.net/maven/1//org.apache.openejb/jars/openejb-loader-3.0.3.jar
[INFO] [INFO] Unable to find resource 'org.apache.openejb:openejb-loader:jar:3.0.3' in repository
java.net (http://download.java.net/maven/1)
[INFO] Downloading: http://repo2.maven.org/maven2/org/apache/openejb/openejb-loader/3.0.3/openejb-loader-3.0.3.jar
[INFO] 
[INFO] Downloading: http://repository.apache.org/snapshots/org/apache/geronimo/testsupport/testsupport-common/2.1.8-SNAPSHOT/testsupport-common-2.1.8-20110623.052743-4.jar
[INFO] 11K downloaded  (testsupport-common-2.1.8-20110623.052743-4.jar)
[INFO] Downloading: http://people.apache.org/repo/m2-incubating-repository/org/apache/xbean/xbean-naming/3.6/xbean-naming-3.6.jar
[INFO] [INFO] Unable to find resource 'org.apache.xbean:xbean-naming:jar:3.6' in repository
apache-incubating-repository (http://people.apache.org/repo/m2-incubating-repository)
[INFO] Downloading: http://tomcat.apache.org/dev/dist/m2-repository/org/apache/xbean/xbean-naming/3.6/xbean-naming-3.6.jar
[INFO] [INFO] Unable to find resource 'org.apache.xbean:xbean-naming:jar:3.6' in repository
tomcat-private-repository (http://tomcat.apache.org/dev/dist/m2-repository)
[INFO] Downloading: http://svn.apache.org/repos/asf/openejb/repo//org/apache/xbean/xbean-naming/3.6/xbean-naming-3.6.jar
[INFO] [INFO] Unable to find resource 'org.apache.xbean:xbean-naming:jar:3.6' in repository
openejb-3rdparty-builds (http://svn.apache.org/repos/asf/openejb/repo/)
[INFO] Downloading: http://download.java.net/maven/1//org.apache.xbean/jars/xbean-naming-3.6.jar
[INFO] [INFO] Unable to find resource 'org.apache.xbean:xbean-naming:jar:3.6' in repository
java.net (http://download.java.net/maven/1)
[INFO] Downloading: http://repo2.maven.org/maven2/org/apache/xbean/xbean-naming/3.6/xbean-naming-3.6.jar
[INFO] 
[INFO] Downloading: http://repository.apache.org/snapshots/org/apache/geronimo/framework/geronimo-system/2.1.8-SNAPSHOT/geronimo-system-2.1.8-20110623.052743-4.jar
[INFO] 231K downloaded  (geronimo-system-2.1.8-20110623.052743-4.jar)
[INFO] Downloading: http://repo2.maven.org/maven2/org/apache/geronimo/specs/geronimo-ejb_3.0_spec/1.0.1/geronimo-ejb_3.0_spec-1.0.1.jar
[INFO] 
[INFO] Downloading: http://people.apache.org/repo/m2-incubating-repository/org/apache/openejb/openejb-javaagent/3.0.3/openejb-javaagent-3.0.3.jar
[INFO] [INFO] Unable to find resource 'org.apache.openejb:openejb-javaagent:jar:3.0.3' in
repository apache-incubating-repository (http://people.apache.org/repo/m2-incubating-repository)
[INFO] Downloading: http://tomcat.apache.org/dev/dist/m2-repository/org/apache/openejb/openejb-javaagent/3.0.3/openejb-javaagent-3.0.3.jar
[INFO] [INFO] Unable to find resource 'org.apache.openejb:openejb-javaagent:jar:3.0.3' in
repository tomcat-private-repository (http://tomcat.apache.org/dev/dist/m2-repository)
[INFO] Downloading: http://svn.apache.org/repos/asf/openejb/repo//org/apache/openejb/openejb-javaagent/3.0.3/openejb-javaagent-3.0.3.jar
[INFO] [INFO] Unable to find resource 'org.apache.openejb:openejb-javaagent:jar:3.0.3' in
repository openejb-3rdparty-builds (http://svn.apache.org/repos/asf/openejb/repo/)
[INFO] Downloading: http://download.java.net/maven/1//org.apache.openejb/jars/openejb-javaagent-3.0.3.jar
[INFO] [INFO] Unable to find resource 'org.apache.openejb:openejb-javaagent:jar:3.0.3' in
repository java.net (http://download.java.net/maven/1)
[INFO] Downloading: http://repo2.maven.org/maven2/org/apache/openejb/openejb-javaagent/3.0.3/openejb-javaagent-3.0.3.jar
[INFO] 
[INFO] Downloading: http://repository.apache.org/snapshots/org/apache/geronimo/framework/geronimo-cli/2.1.8-SNAPSHOT/geronimo-cli-2.1.8-20110623.052743-4.jar
[INFO] 53K downloaded  (geronimo-cli-2.1.8-20110623.052743-4.jar)
[INFO] Downloading: http://repository.apache.org/snapshots/org/apache/geronimo/framework/geronimo-kernel/2.1.8-SNAPSHOT/geronimo-kernel-2.1.8-20110623.052743-4.jar
[INFO] 
[INFO] Downloading: http://repo2.maven.org/maven2/org/apache/geronimo/specs/geronimo-jacc_1.1_spec/1.0.1/geronimo-jacc_1.1_spec-1.0.1.jar
[INFO] 
[INFO] Downloading: http://people.apache.org/repo/m2-incubating-repository/org/apache/openejb/openejb-jee/3.0.3/openejb-jee-3.0.3.jar
[INFO] 390K downloaded  (geronimo-kernel-2.1.8-20110623.052743-4.jar)
[INFO] [INFO] Unable to find resource 'org.apache.openejb:openejb-jee:jar:3.0.3' in repository
apache-incubating-repository (http://people.apache.org/repo/m2-incubating-repository)
[INFO] Downloading: http://tomcat.apache.org/dev/dist/m2-repository/org/apache/openejb/openejb-jee/3.0.3/openejb-jee-3.0.3.jar
[INFO] Downloading: http://repository.apache.org/snapshots/org/apache/geronimo/framework/geronimo-crypto/2.1.8-SNAPSHOT/geronimo-crypto-2.1.8-20110623.052743-4.jar
[INFO] [INFO] Unable to find resource 'org.apache.openejb:openejb-jee:jar:3.0.3' in repository
tomcat-private-repository (http://tomcat.apache.org/dev/dist/m2-repository)
[INFO] Downloading: http://svn.apache.org/repos/asf/openejb/repo//org/apache/openejb/openejb-jee/3.0.3/openejb-jee-3.0.3.jar
[INFO] [INFO] Unable to find resource 'org.apache.openejb:openejb-jee:jar:3.0.3' in repository
openejb-3rdparty-builds (http://svn.apache.org/repos/asf/openejb/repo/)
[INFO] Downloading: http://download.java.net/maven/1//org.apache.openejb/jars/openejb-jee-3.0.3.jar
[INFO] [INFO] Unable to find resource 'org.apache.openejb:openejb-jee:jar:3.0.3' in repository
java.net (http://download.java.net/maven/1)
[INFO] Downloading: http://repo2.maven.org/maven2/org/apache/openejb/openejb-jee/3.0.3/openejb-jee-3.0.3.jar
[INFO] 271K downloaded  (geronimo-crypto-2.1.8-20110623.052743-4.jar)
[INFO] Downloading: http://repository.apache.org/snapshots/org/apache/geronimo/framework/geronimo-common/2.1.8-SNAPSHOT/geronimo-common-2.1.8-20110623.052743-4.jar
[INFO] 41K downloaded  (geronimo-common-2.1.8-20110623.052743-4.jar)
[INFO] Downloading: http://repository.apache.org/snapshots/org/apache/geronimo/framework/geronimo-management/2.1.8-SNAPSHOT/geronimo-management-2.1.8-20110623.052743-4.jar
[INFO] 75K downloaded  (geronimo-management-2.1.8-20110623.052743-4.jar)
[INFO] Downloading: http://repository.apache.org/snapshots/org/apache/geronimo/framework/geronimo-interceptor/2.1.8-SNAPSHOT/geronimo-interceptor-2.1.8-20110623.052743-4.jar
[INFO] 7K downloaded  (geronimo-interceptor-2.1.8-20110623.052743-4.jar)
[INFO] Downloading: http://repository.apache.org/snapshots/org/apache/geronimo/framework/geronimo-j2ee/2.1.8-SNAPSHOT/geronimo-j2ee-2.1.8-20110623.052743-4.jar
[INFO] 32K downloaded  (geronimo-j2ee-2.1.8-20110623.052743-4.jar)
[INFO] 
[INFO] Downloading: http://repo2.maven.org/maven2/org/apache/geronimo/specs/geronimo-servlet_2.5_spec/1.2/geronimo-servlet_2.5_spec-1.2.jar
[INFO] 
[INFO] 
[INFO] Downloading: http://people.apache.org/repo/m2-incubating-repository/org/apache/openejb/commons-dbcp-all/1.3/commons-dbcp-all-1.3.jar
[INFO] [INFO] Unable to find resource 'org.apache.openejb:commons-dbcp-all:jar:1.3' in repository
apache-incubating-repository (http://people.apache.org/repo/m2-incubating-repository)
[INFO] Downloading: http://tomcat.apache.org/dev/dist/m2-repository/org/apache/openejb/commons-dbcp-all/1.3/commons-dbcp-all-1.3.jar
[INFO] [INFO] Unable to find resource 'org.apache.openejb:commons-dbcp-all:jar:1.3' in repository
tomcat-private-repository (http://tomcat.apache.org/dev/dist/m2-repository)
[INFO] Downloading: http://svn.apache.org/repos/asf/openejb/repo//org/apache/openejb/commons-dbcp-all/1.3/commons-dbcp-all-1.3.jar
[INFO] [INFO] Unable to find resource 'org.apache.openejb:commons-dbcp-all:jar:1.3' in repository
openejb-3rdparty-builds (http://svn.apache.org/repos/asf/openejb/repo/)
[INFO] Downloading: http://download.java.net/maven/1//org.apache.openejb/jars/commons-dbcp-all-1.3.jar
[INFO] [INFO] Unable to find resource 'org.apache.openejb:commons-dbcp-all:jar:1.3' in repository
java.net (http://download.java.net/maven/1)
[INFO] Downloading: http://repo2.maven.org/maven2/org/apache/openejb/commons-dbcp-all/1.3/commons-dbcp-all-1.3.jar
[INFO] 
[INFO] Downloading: http://repo2.maven.org/maven2/org/apache/openejb/openejb-client/3.0.3/openejb-client-3.0.3.jar
[INFO] 
[INFO] 
[INFO] 
[INFO] [INFO] ------------------------------------------------------------------------
[INFO] [ERROR] BUILD ERROR
--
[INFO] 
[INFO]   Try downloading the file manually from the project website.
[INFO] 
[INFO]   Then, install it using the command: 
[INFO]       mvn install:install-file -DgroupId=org.apache.activemq -DartifactId=activemq-core
-Dversion=4.1.2-G20110506 -Dpackaging=jar -Dfile=/path/to/file
[INFO] 
[INFO]   Alternatively, if you host your own repository you can deploy the file there: 
[INFO]       mvn deploy:deploy-file -DgroupId=org.apache.activemq -DartifactId=activemq-core
-Dversion=4.1.2-G20110506 -Dpackaging=jar -Dfile=/path/to/file -Durl=[url] -DrepositoryId=[id]
[INFO] 
[INFO]   Path to dependency: 
[INFO]   	1) org.apache.geronimo.testsuite:test-security:war:2.1.8-SNAPSHOT
[INFO]   	2) org.apache.openejb:openejb-core:jar:3.0.3
[INFO]   	3) org.apache.activemq:activemq-core:jar:4.1.2-G20110506
[INFO] 
[INFO] ----------
[INFO] 2 required artifacts are missing.
[INFO] 
[INFO] for artifact: 
[INFO]   org.apache.geronimo.testsuite:test-security:war:2.1.8-SNAPSHOT
[INFO] 
[INFO] from the specified remote repositories:
[INFO]   codehaus.snapshots (http://snapshots.repository.codehaus.org),
[INFO]   ibiblio.org (http://repo2.maven.org/maven2),
[INFO]   apache.snapshots (http://repository.apache.org/snapshots)
[INFO] 
[INFO] 
[INFO] 	at org.apache.maven.lifecycle.DefaultLifecycleExecutor.executeGoals(DefaultLifecycleExecutor.java:711)
[INFO] 	at org.apache.maven.lifecycle.DefaultLifecycleExecutor.executeGoalWithLifecycle(DefaultLifecycleExecutor.java:556)
[INFO] 	at org.apache.maven.lifecycle.DefaultLifecycleExecutor.executeGoal(DefaultLifecycleExecutor.java:535)
[INFO] 	at org.apache.maven.lifecycle.DefaultLifecycleExecutor.executeGoalAndHandleFailures(DefaultLifecycleExecutor.java:387)
[INFO] 	at org.apache.maven.lifecycle.DefaultLifecycleExecutor.executeTaskSegments(DefaultLifecycleExecutor.java:348)
[INFO] 	at org.apache.maven.lifecycle.DefaultLifecycleExecutor.execute(DefaultLifecycleExecutor.java:180)
[INFO] 	at org.apache.maven.DefaultMaven.doExecute(DefaultMaven.java:328)
[INFO] 	at org.apache.maven.DefaultMaven.execute(DefaultMaven.java:138)
[INFO] 	at org.apache.maven.cli.MavenCli.main(MavenCli.java:362)
[INFO] 	at org.apache.maven.cli.compat.CompatibleMain.main(CompatibleMain.java:60)
[INFO] 	at sun.reflect.NativeMethodAccessorImpl.invoke0(Native Method)
[INFO] 	at sun.reflect.NativeMethodAccessorImpl.invoke(NativeMethodAccessorImpl.java:39)
[INFO] 	at sun.reflect.DelegatingMethodAccessorImpl.invoke(DelegatingMethodAccessorImpl.java:25)
[INFO] 	at java.lang.reflect.Method.invoke(Method.java:592)
[INFO] 	at org.codehaus.classworlds.Launcher.launchEnhanced(Launcher.java:315)
[INFO] 	at org.codehaus.classworlds.Launcher.launch(Launcher.java:255)
[INFO] 	at org.codehaus.classworlds.Launcher.mainWithExitCode(Launcher.java:430)
[INFO] 	at org.codehaus.classworlds.Launcher.main(Launcher.java:375)
[INFO] Caused by: org.apache.maven.artifact.resolver.MultipleArtifactsNotFoundException: Missing:
[INFO] ----------
[INFO] 1) org.apache.activemq:activemq-ra:jar:4.1.2-G20110506
[INFO] 
[INFO]   Try downloading the file manually from the project website.
[INFO] 
[INFO]   Then, install it using the command: 
[INFO]       mvn install:install-file -DgroupId=org.apache.activemq -DartifactId=activemq-ra
-Dversion=4.1.2-G20110506 -Dpackaging=jar -Dfile=/path/to/file
[INFO] 
[INFO]   Alternatively, if you host your own repository you can deploy the file there: 
[INFO]       mvn deploy:deploy-file -DgroupId=org.apache.activemq -DartifactId=activemq-ra
-Dversion=4.1.2-G20110506 -Dpackaging=jar -Dfile=/path/to/file -Durl=[url] -DrepositoryId=[id]
[INFO] 
[INFO]   Path to dependency: 
[INFO]   	1) org.apache.geronimo.testsuite:test-security:war:2.1.8-SNAPSHOT
[INFO]   	2) org.apache.openejb:openejb-core:jar:3.0.3
[INFO]   	3) org.apache.activemq:activemq-ra:jar:4.1.2-G20110506
[INFO] 
[INFO] 2) org.apache.activemq:activemq-core:jar:4.1.2-G20110506
[INFO] 
[INFO]   Try downloading the file manually from the project website.
[INFO] 
[INFO]   Then, install it using the command: 
[INFO]       mvn install:install-file -DgroupId=org.apache.activemq -DartifactId=activemq-core
-Dversion=4.1.2-G20110506 -Dpackaging=jar -Dfile=/path/to/file
[INFO] 
[INFO]   Alternatively, if you host your own repository you can deploy the file there: 
[INFO]       mvn deploy:deploy-file -DgroupId=org.apache.activemq -DartifactId=activemq-core
-Dversion=4.1.2-G20110506 -Dpackaging=jar -Dfile=/path/to/file -Durl=[url] -DrepositoryId=[id]
[INFO] 
[INFO]   Path to dependency: 
[INFO]   	1) org.apache.geronimo.testsuite:test-security:war:2.1.8-SNAPSHOT
[INFO]   	2) org.apache.openejb:openejb-core:jar:3.0.3
[INFO]   	3) org.apache.activemq:activemq-core:jar:4.1.2-G20110506
[INFO] 
[INFO] ----------
[INFO] 2 required artifacts are missing.
[INFO] 
[INFO] for artifact: 
[INFO]   org.apache.geronimo.testsuite:test-security:war:2.1.8-SNAPSHOT
[INFO] 
[INFO] from the specified remote repositories:
[INFO]   codehaus.snapshots (http://snapshots.repository.codehaus.org),
[INFO]   ibiblio.org (http://repo2.maven.org/maven2),
[INFO]   apache.snapshots (http://repository.apache.org/snapshots)
[INFO] 
[INFO] 
[INFO] 	at org.apache.maven.artifact.resolver.DefaultArtifactResolver.resolveTransitively(DefaultArtifactResolver.java:360)
[INFO] 	at org.apache.maven.artifact.resolver.DefaultArtifactResolver.resolveTransitively(DefaultArtifactResolver.java:304)
[INFO] 	at org.apache.maven.plugin.DefaultPluginManager.resolveTransitiveDependencies(DefaultPluginManager.java:1499)
[INFO] 	at org.apache.maven.plugin.DefaultPluginManager.executeMojo(DefaultPluginManager.java:442)
[INFO] 	at org.apache.maven.lifecycle.DefaultLifecycleExecutor.executeGoals(DefaultLifecycleExecutor.java:694)
[INFO] 	... 17 more
[INFO] [INFO] ------------------------------------------------------------------------
[INFO] [INFO] Total time: 63 minutes 10 seconds
[INFO] [INFO] Finished at: Fri Jun 24 09:04:09 EDT 2011
[INFO] [INFO] Final Memory: 31M/510M
[INFO] [INFO] ------------------------------------------------------------------------
[INFO] ------------------------------------------------------------------------
[ERROR] BUILD ERROR
 
Samples: branches/2.1
=================================
Log: http://people.apache.org/builds/geronimo/server/binaries/2.1/20110624/samples-0200.log
 
Build status: FAILED
 

Mime
View raw message