geronimo-dev mailing list archives

Site index · List index
Message view « Date » · « Thread »
Top « Date » · « Thread »
From ga...@apache.org (Jarek Gawor)
Subject [BUILD] trunk: Failed for Revision: 1138270
Date Wed, 22 Jun 2011 01:17:44 GMT
Geronimo Revision: 1138270 built with tests included
 
See the full build-2100.log file at http://people.apache.org/builds/geronimo/server/binaries/trunk/20110621/build-2100.log
 
 
See the unit test reports at http://people.apache.org/builds/geronimo/server/binaries/trunk/20110621/unit-test-reports
 
Downloading: http://nexus.openqa.org/content/repositories/releases/org/apache/geronimo/genesis/genesis/2.0/genesis-2.0.pom
[INFO] Unable to find resource 'org.apache.geronimo.genesis:genesis:pom:2.0' in repository
openqa-releases (http://nexus.openqa.org/content/repositories/releases)
Downloading: http://repo2.maven.org/maven2/org/apache/geronimo/genesis/genesis/2.0/genesis-2.0.pom

Downloading: file:///home/geronimo/.m2/jtidy.repository/org/apache/apache/6/apache-6.pom
[INFO] Unable to find resource 'org.apache:apache:pom:6' in repository local (file:///home/geronimo/.m2/jtidy.repository)
Downloading: http://svn.apache.org/repos/asf/geronimo/repo//org/apache/apache/6/apache-6.pom
[INFO] Unable to find resource 'org.apache:apache:pom:6' in repository geronimo-svn-repo (http://svn.apache.org/repos/asf/geronimo/repo/)
Downloading: http://oss.sonatype.org/content/groups/jetty-with-staging/org/apache/apache/6/apache-6.pom
[INFO] Unable to find resource 'org.apache:apache:pom:6' in repository jetty.oss.sonatype.org
(http://oss.sonatype.org/content/groups/jetty-with-staging)
Downloading: http://svn.apache.org/repos/asf/servicemix/m2-repo//org/apache/apache/6/apache-6.pom
[INFO] Unable to find resource 'org.apache:apache:pom:6' in repository smx.svn (http://svn.apache.org/repos/asf/servicemix/m2-repo/)
Downloading: http://download.java.net/maven/2//org/apache/apache/6/apache-6.pom
[INFO] Unable to find resource 'org.apache:apache:pom:6' in repository java.net2 (http://download.java.net/maven/2/)
Downloading: http://nexus.openqa.org/content/repositories/releases/org/apache/apache/6/apache-6.pom
[INFO] Unable to find resource 'org.apache:apache:pom:6' in repository openqa-releases (http://nexus.openqa.org/content/repositories/releases)
Downloading: http://repo2.maven.org/maven2/org/apache/apache/6/apache-6.pom

Downloading: file:///home/geronimo/.m2/jtidy.repository/org/apache/karaf/karaf/2.2.1/karaf-2.2.1.pom
[INFO] Unable to find resource 'org.apache.karaf:karaf:pom:2.2.1' in repository local (file:///home/geronimo/.m2/jtidy.repository)
Downloading: http://svn.apache.org/repos/asf/geronimo/repo//org/apache/karaf/karaf/2.2.1/karaf-2.2.1.pom
[INFO] Unable to find resource 'org.apache.karaf:karaf:pom:2.2.1' in repository geronimo-svn-repo
(http://svn.apache.org/repos/asf/geronimo/repo/)
Downloading: http://oss.sonatype.org/content/groups/jetty-with-staging/org/apache/karaf/karaf/2.2.1/karaf-2.2.1.pom
[INFO] Unable to find resource 'org.apache.karaf:karaf:pom:2.2.1' in repository jetty.oss.sonatype.org
(http://oss.sonatype.org/content/groups/jetty-with-staging)
Downloading: http://svn.apache.org/repos/asf/servicemix/m2-repo//org/apache/karaf/karaf/2.2.1/karaf-2.2.1.pom
[INFO] Unable to find resource 'org.apache.karaf:karaf:pom:2.2.1' in repository smx.svn (http://svn.apache.org/repos/asf/servicemix/m2-repo/)
Downloading: http://download.java.net/maven/2//org/apache/karaf/karaf/2.2.1/karaf-2.2.1.pom
[INFO] Unable to find resource 'org.apache.karaf:karaf:pom:2.2.1' in repository java.net2
(http://download.java.net/maven/2/)
Downloading: http://nexus.openqa.org/content/repositories/releases/org/apache/karaf/karaf/2.2.1/karaf-2.2.1.pom
[INFO] Unable to find resource 'org.apache.karaf:karaf:pom:2.2.1' in repository openqa-releases
(http://nexus.openqa.org/content/repositories/releases)
Downloading: http://repo2.maven.org/maven2/org/apache/karaf/karaf/2.2.1/karaf-2.2.1.pom

Downloading: http://svn.apache.org/repos/asf/servicemix/m2-repo/org/apache/apache/8/apache-8.pom
[INFO] Unable to find resource 'org.apache:apache:pom:8' in repository servicemix (http://svn.apache.org/repos/asf/servicemix/m2-repo)
Downloading: file:///home/geronimo/.m2/jtidy.repository/org/apache/apache/8/apache-8.pom
[INFO] Unable to find resource 'org.apache:apache:pom:8' in repository local (file:///home/geronimo/.m2/jtidy.repository)
Downloading: http://svn.apache.org/repos/asf/geronimo/repo//org/apache/apache/8/apache-8.pom
[INFO] Unable to find resource 'org.apache:apache:pom:8' in repository geronimo-svn-repo (http://svn.apache.org/repos/asf/geronimo/repo/)
Downloading: http://oss.sonatype.org/content/groups/jetty-with-staging/org/apache/apache/8/apache-8.pom
[INFO] Unable to find resource 'org.apache:apache:pom:8' in repository jetty.oss.sonatype.org
(http://oss.sonatype.org/content/groups/jetty-with-staging)
Downloading: http://svn.apache.org/repos/asf/servicemix/m2-repo//org/apache/apache/8/apache-8.pom
[INFO] Unable to find resource 'org.apache:apache:pom:8' in repository smx.svn (http://svn.apache.org/repos/asf/servicemix/m2-repo/)
Downloading: http://download.java.net/maven/2//org/apache/apache/8/apache-8.pom
[INFO] Unable to find resource 'org.apache:apache:pom:8' in repository java.net2 (http://download.java.net/maven/2/)
Downloading: http://nexus.openqa.org/content/repositories/releases/org/apache/apache/8/apache-8.pom
[INFO] Unable to find resource 'org.apache:apache:pom:8' in repository openqa-releases (http://nexus.openqa.org/content/repositories/releases)
Downloading: http://repo2.maven.org/maven2/org/apache/apache/8/apache-8.pom

[INFO] snapshot org.apache.yoko:yoko:1.2-SNAPSHOT: checking for updates from local
[INFO] snapshot org.apache.yoko:yoko:1.2-SNAPSHOT: checking for updates from jetty.oss.sonatype.org
[INFO] snapshot org.apache.yoko:yoko:1.2-SNAPSHOT: checking for updates from openqa-snapshots
[INFO] snapshot org.apache.yoko:yoko:1.2-SNAPSHOT: checking for updates from codehaus.snapshots
[INFO] snapshot org.apache.yoko:yoko:1.2-SNAPSHOT: checking for updates from apache.snapshots
Downloading: http://repository.apache.org/snapshots/org/apache/yoko/yoko/1.2-SNAPSHOT/yoko-1.2-20110507.094358-8.pom
10K downloaded  (yoko-1.2-20110507.094358-8.pom)
Downloading: file:///home/geronimo/.m2/jtidy.repository/org/apache/geronimo/genesis/genesis-java5-flava/2.0/genesis-java5-flava-2.0.pom
[INFO] Unable to find resource 'org.apache.geronimo.genesis:genesis-java5-flava:pom:2.0' in
repository local (file:///home/geronimo/.m2/jtidy.repository)
Downloading: http://svn.apache.org/repos/asf/geronimo/repo//org/apache/geronimo/genesis/genesis-java5-flava/2.0/genesis-java5-flava-2.0.pom
[INFO] Unable to find resource 'org.apache.geronimo.genesis:genesis-java5-flava:pom:2.0' in
repository geronimo-svn-repo (http://svn.apache.org/repos/asf/geronimo/repo/)
Downloading: http://oss.sonatype.org/content/groups/jetty-with-staging/org/apache/geronimo/genesis/genesis-java5-flava/2.0/genesis-java5-flava-2.0.pom
[INFO] Unable to find resource 'org.apache.geronimo.genesis:genesis-java5-flava:pom:2.0' in
repository jetty.oss.sonatype.org (http://oss.sonatype.org/content/groups/jetty-with-staging)
Downloading: http://svn.apache.org/repos/asf/servicemix/m2-repo//org/apache/geronimo/genesis/genesis-java5-flava/2.0/genesis-java5-flava-2.0.pom
[INFO] Unable to find resource 'org.apache.geronimo.genesis:genesis-java5-flava:pom:2.0' in
repository smx.svn (http://svn.apache.org/repos/asf/servicemix/m2-repo/)
Downloading: http://download.java.net/maven/2//org/apache/geronimo/genesis/genesis-java5-flava/2.0/genesis-java5-flava-2.0.pom
[INFO] Unable to find resource 'org.apache.geronimo.genesis:genesis-java5-flava:pom:2.0' in
repository java.net2 (http://download.java.net/maven/2/)
Downloading: http://nexus.openqa.org/content/repositories/releases/org/apache/geronimo/genesis/genesis-java5-flava/2.0/genesis-java5-flava-2.0.pom
[INFO] Unable to find resource 'org.apache.geronimo.genesis:genesis-java5-flava:pom:2.0' in
repository openqa-releases (http://nexus.openqa.org/content/repositories/releases)
Downloading: http://repo2.maven.org/maven2/org/apache/geronimo/genesis/genesis-java5-flava/2.0/genesis-java5-flava-2.0.pom

[INFO] ------------------------------------------------------------------------
[ERROR] BUILD FAILURE
[INFO] ------------------------------------------------------------------------
[INFO] The projects in the reactor contain a cyclic reference: Edge between 'Vertex{label='org.apache.geronimo.modules:geronimo-security-builder'}'
and 'Vertex{label='org.apache.geronimo.modules:geronimo-j2ee-builder'}' introduces to cycle
in the graph org.apache.geronimo.modules:geronimo-j2ee-builder --> org.apache.geronimo.modules:geronimo-j2ee-schema
--> org.apache.geronimo.buildsupport:car-maven-plugin --> org.apache.geronimo.framework:geronimo-deploy-tool
--> org.apache.geronimo.framework:geronimo-deploy-jsr88 --> org.apache.geronimo.framework:geronimo-bundle-recorder
--> org.apache.geronimo.modules:geronimo-security-builder --> org.apache.geronimo.modules:geronimo-j2ee-builder
[INFO] ------------------------------------------------------------------------
[INFO] Trace
org.apache.maven.BuildFailureException: The projects in the reactor contain a cyclic reference:
Edge between 'Vertex{label='org.apache.geronimo.modules:geronimo-security-builder'}' and 'Vertex{label='org.apache.geronimo.modules:geronimo-j2ee-builder'}'
introduces to cycle in the graph org.apache.geronimo.modules:geronimo-j2ee-builder -->
org.apache.geronimo.modules:geronimo-j2ee-schema --> org.apache.geronimo.buildsupport:car-maven-plugin
--> org.apache.geronimo.framework:geronimo-deploy-tool --> org.apache.geronimo.framework:geronimo-deploy-jsr88
--> org.apache.geronimo.framework:geronimo-bundle-recorder --> org.apache.geronimo.modules:geronimo-security-builder
--> org.apache.geronimo.modules:geronimo-j2ee-builder
	at org.apache.maven.DefaultMaven.doExecute(DefaultMaven.java:295)
	at org.apache.maven.DefaultMaven.execute(DefaultMaven.java:138)
	at org.apache.maven.cli.MavenCli.main(MavenCli.java:362)
	at org.apache.maven.cli.compat.CompatibleMain.main(CompatibleMain.java:60)
	at sun.reflect.NativeMethodAccessorImpl.invoke0(Native Method)
	at sun.reflect.NativeMethodAccessorImpl.invoke(NativeMethodAccessorImpl.java:39)
	at sun.reflect.DelegatingMethodAccessorImpl.invoke(DelegatingMethodAccessorImpl.java:25)
	at java.lang.reflect.Method.invoke(Method.java:597)
	at org.codehaus.classworlds.Launcher.launchEnhanced(Launcher.java:315)
	at org.codehaus.classworlds.Launcher.launch(Launcher.java:255)
	at org.codehaus.classworlds.Launcher.mainWithExitCode(Launcher.java:430)
	at org.codehaus.classworlds.Launcher.main(Launcher.java:375)
Caused by: hidden.org.codehaus.plexus.util.dag.CycleDetectedException: Edge between 'Vertex{label='org.apache.geronimo.modules:geronimo-security-builder'}'
and 'Vertex{label='org.apache.geronimo.modules:geronimo-j2ee-builder'}' introduces to cycle
in the graph org.apache.geronimo.modules:geronimo-j2ee-builder --> org.apache.geronimo.modules:geronimo-j2ee-schema
--> org.apache.geronimo.buildsupport:car-maven-plugin --> org.apache.geronimo.framework:geronimo-deploy-tool
--> org.apache.geronimo.framework:geronimo-deploy-jsr88 --> org.apache.geronimo.framework:geronimo-bundle-recorder
--> org.apache.geronimo.modules:geronimo-security-builder --> org.apache.geronimo.modules:geronimo-j2ee-builder
	at hidden.org.codehaus.plexus.util.dag.DAG.addEdge(DAG.java:143)
	at hidden.org.codehaus.plexus.util.dag.DAG.addEdge(DAG.java:123)
	at org.apache.maven.project.ProjectSorter.<init>(ProjectSorter.java:118)
	at org.apache.maven.execution.ReactorManager.<init>(ReactorManager.java:99)
	at org.apache.maven.DefaultMaven.doExecute(DefaultMaven.java:288)
	... 11 more
[INFO] ------------------------------------------------------------------------
[INFO] Total time: 28 seconds
[INFO] Finished at: Tue Jun 21 21:01:51 EDT 2011
[INFO] Final Memory: 83M/626M
[INFO] ------------------------------------------------------------------------

Mime
View raw message