geronimo-dev mailing list archives

Site index · List index
Message view « Date » · « Thread »
Top « Date » · « Thread »
From ga...@apache.org (Jarek Gawor)
Subject [BUILD] branches/2.1: Failed for Revision: 1137127
Date Sat, 18 Jun 2011 23:46:23 GMT
Geronimo Revision: 1137127 built with tests included
 
See the full build-0200.log file at http://people.apache.org/builds/geronimo/server/binaries/2.1/20110618/build-0200.log
 
Download the binaries from http://people.apache.org/builds/geronimo/server/binaries/2.1/20110618
[INFO] BUILD SUCCESSFUL
[INFO] ------------------------------------------------------------------------
[INFO] Total time: 199 minutes 47 seconds
[INFO] Finished at: Sat Jun 18 18:37:47 EDT 2011
[INFO] Final Memory: 309M/850M
[INFO] ------------------------------------------------------------------------
 
TESTSUITE RESULTS (Failures only)
=================================
 
Assembly: tomcat
=================================
See full test results and logs at http://people.apache.org/builds/geronimo/server/binaries/2.1/20110618/logs-0200-tomcat/
 
[INFO] Running security-testsuite.security
[INFO] Tests run: 36, Failures: 1, Errors: 0, Skipped: 0, Time elapsed: 60.172 sec <<<
FAILURE!
 
Assembly: jetty
=================================
See full test results and logs at http://people.apache.org/builds/geronimo/server/binaries/2.1/20110618/logs-0200-jetty/
 
 
[INFO] 
[INFO] Results :
[INFO] 
[INFO] Tests run: 1, Failures: 0, Errors: 0, Skipped: 0
[INFO] 
[INFO] [INFO] [geronimo:undeploy-module {execution: undeploy-client-as-moduleId}]
[INFO] [INFO] Using non-artifact based module id: JEE5/StaxClientServer/1.1/car
[INFO] [INFO] Stopping module: JEE5/StaxClientServer/1.1/car
[INFO] [INFO] Stopped module(s):
[INFO] [INFO]     [0] JEE5/StaxClientServer/1.1/car
[INFO] [INFO] Undeploying module: JEE5/StaxClientServer/1.1/car
[INFO] [INFO] Undeployed module(s):
[INFO] [INFO]     [0] JEE5/StaxClientServer/1.1/car
[INFO] [INFO] [ianal:verify-legal-files {execution: default}]
[INFO] [WARNING] Skipping verification of legal files in artifacts:
[INFO] [WARNING]     org.apache.geronimo.testsuite:stax-client:jar:2.1.8-SNAPSHOT
[INFO] [INFO] [install:install {execution: default-install}]
[INFO] [INFO] Installing /home/geronimo/geronimo/2.1/testsuite/webservices-testsuite/stax-tests/stax-client/target/stax-client-2.1.8-SNAPSHOT.jar
to /home/geronimo/.m2/repository/org/apache/geronimo/testsuite/stax-client/2.1.8-SNAPSHOT/stax-client-2.1.8-SNAPSHOT.jar
[INFO] [INFO] [testsuite:generate-surefire-xml {execution: generate-surefire-xml}]
[INFO] [INFO] Updating directory: /home/geronimo/geronimo/2.1/testsuite/webservices-testsuite/target/surefire-reports
[INFO] [INFO] Loading surefire xml for xmlproperty: /home/geronimo/geronimo/2.1/testsuite/webservices-testsuite/stax-tests/stax-client/target/surefire-reports/TEST-org.apache.geronimo.mavenplugins.geronimo.module.DeployModuleMojo.xml
[INFO] [INFO] Loading surefire xml for xmlproperty: /home/geronimo/geronimo/2.1/testsuite/webservices-testsuite/stax-tests/stax-client/target/surefire-reports/TEST-org.apache.geronimo.mavenplugins.geronimo.module.UndeployModuleMojo.xml
[INFO] [INFO] Loading parent surefire xml for xmlproperty: /home/geronimo/geronimo/2.1/testsuite/webservices-testsuite/target/surefire-reports/TEST-stax-client.xml
[INFO] [INFO] Loading surefire xml for xmlproperty: /home/geronimo/geronimo/2.1/testsuite/webservices-testsuite/stax-tests/stax-client/target/surefire-reports/TEST-org.apache.geronimo.mavenplugins.geronimo.server.RunClientMojo.xml
[INFO] [INFO] Loading parent surefire xml for xmlproperty: /home/geronimo/geronimo/2.1/testsuite/webservices-testsuite/target/surefire-reports/TEST-stax-client.xml
[INFO] [INFO] Loading surefire xml for xmlproperty: /home/geronimo/geronimo/2.1/testsuite/webservices-testsuite/stax-tests/stax-client/target/surefire-reports/TEST-org.apache.geronimo.testsuite.testset.ClientStaxTest.xml
[INFO] [INFO] Loading parent surefire xml for xmlproperty: /home/geronimo/geronimo/2.1/testsuite/webservices-testsuite/target/surefire-reports/TEST-stax-client.xml
[INFO] [INFO] 
[INFO] [INFO] 
[INFO] [INFO] ------------------------------------------------------------------------
[INFO] [INFO] Reactor Summary:
[INFO] [INFO] ------------------------------------------------------------------------
[INFO] [INFO] Geronimo TestSuite :: WebServices TestSuite :: StAX ... SUCCESS [8.538s]
[INFO] [INFO] Geronimo TestSuite :: WebServices TestSuite :: StAX WAR  SUCCESS [12.672s]
[INFO] [INFO] Geronimo TestSuite :: WebServices TestSuite :: StAX EJB  SUCCESS [11.409s]
[INFO] [INFO] Geronimo TestSuite :: WebServices TestSuite :: StAX Client  SUCCESS [11.954s]
[INFO] [INFO] ------------------------------------------------------------------------
[INFO] [INFO] ------------------------------------------------------------------------
[INFO] [INFO] BUILD SUCCESSFUL
[INFO] [INFO] ------------------------------------------------------------------------
[INFO] [INFO] Total time: 46 seconds
[INFO] [INFO] Finished at: Sat Jun 18 20:00:03 EDT 2011
[INFO] [INFO] Final Memory: 55M/548M
[INFO] [INFO] ------------------------------------------------------------------------
[INFO] Invoking: /home/geronimo/geronimo/2.1/testsuite/webservices-testsuite/jaxrpc-jaxws-tests/pom.xml
[INFO] + Error stacktraces are turned on.
[INFO] [INFO] Scanning for projects...
[INFO] [INFO] Reactor build order: 
[INFO] [INFO]   Geronimo TestSuite :: WebServices TestSuite :: JAX-RPC - JAX-WS
[INFO] [INFO]   Geronimo TestSuite :: WebServices TestSuite :: JAX-RPC - JAX-WS WAR
[INFO] [INFO] ------------------------------------------------------------------------
[INFO] [INFO] Building Geronimo TestSuite :: WebServices TestSuite :: JAX-RPC - JAX-WS
[INFO] [INFO]    task-segment: [install]
[INFO] [INFO] ------------------------------------------------------------------------
[INFO] [INFO] [genesis:validate-configuration {execution: default}]
[INFO] Downloading: http://nexus.openqa.org/content/repositories/releases/commons-logging/commons-logging/1.0.4/commons-logging-1.0.4.pom
[INFO] [INFO] Unable to find resource 'commons-logging:commons-logging:pom:1.0.4' in repository
openqa-releases (http://nexus.openqa.org/content/repositories/releases)
[INFO] Downloading: http://repo2.maven.org/maven2/commons-logging/commons-logging/1.0.4/commons-logging-1.0.4.pom
[INFO] 
[INFO] Downloading: http://nexus.openqa.org/content/repositories/releases/commons-logging/commons-logging/1.0.4/commons-logging-1.0.4.jar
[INFO] [INFO] Unable to find resource 'commons-logging:commons-logging:jar:1.0.4' in repository
openqa-releases (http://nexus.openqa.org/content/repositories/releases)
[INFO] Downloading: http://repo2.maven.org/maven2/commons-logging/commons-logging/1.0.4/commons-logging-1.0.4.jar
[INFO] 
[INFO] Downloading: http://repo2.maven.org/maven2/org/codehaus/plexus/plexus-utils/1.5.8/plexus-utils-1.5.8.pom
[INFO] 
[INFO] Downloading: http://repo2.maven.org/maven2/org/codehaus/plexus/plexus/2.0.2/plexus-2.0.2.pom
[INFO] 
[INFO] Downloading: http://repo2.maven.org/maven2/org/codehaus/plexus/plexus-container-default/1.0-alpha-9-stable-1/plexus-container-default-1.0-alpha-9-stable-1.pom
[INFO] 
[INFO] Downloading: http://repo2.maven.org/maven2/slide/slide-webdavlib/2.1/slide-webdavlib-2.1.pom
[INFO] 
[INFO] Downloading: http://repo2.maven.org/maven2/commons-logging/commons-logging/1.0.3/commons-logging-1.0.3.pom
[INFO] 
[INFO] Downloading: http://repo2.maven.org/maven2/jtidy/jtidy/4aug2000r7-dev/jtidy-4aug2000r7-dev.pom
[INFO] 
[INFO] Downloading: http://repo2.maven.org/maven2/xml-apis/xml-apis/1.0.b2/xml-apis-1.0.b2.pom
[INFO] 
[INFO] Downloading: http://repo2.maven.org/maven2/org/codehaus/plexus/plexus-interactivity-api/1.0-alpha-4/plexus-interactivity-api-1.0-alpha-4.pom
[INFO] 
[INFO] Downloading: http://repo2.maven.org/maven2/org/codehaus/plexus/plexus-container-default/1.0-alpha-7/plexus-container-default-1.0-alpha-7.pom
[INFO] 
[INFO] Downloading: http://repo2.maven.org/maven2/plexus/plexus-containers/1.0.2/plexus-containers-1.0.2.pom
[INFO] 
[INFO] Downloading: http://repo2.maven.org/maven2/plexus/plexus-root/1.0.3/plexus-root-1.0.3.pom
[INFO] 
[INFO] Downloading: http://repo2.maven.org/maven2/plexus/plexus-utils/1.0.2/plexus-utils-1.0.2.pom
[INFO] 
[INFO] Downloading: http://repo2.maven.org/maven2/org/beanshell/bsh/2.0b4/bsh-2.0b4.pom
[INFO] 
[INFO] Downloading: http://repo2.maven.org/maven2/org/beanshell/beanshell/2.0b4/beanshell-2.0b4.pom
[INFO] 
[INFO] Downloading: http://repo2.maven.org/maven2/org/codehaus/plexus/plexus-utils/1.5.8/plexus-utils-1.5.8.jar
[INFO] Downloading: http://repo2.maven.org/maven2/org/beanshell/bsh/2.0b4/bsh-2.0b4.jar
[INFO] 
[INFO] [INFO] Unable to find resource 'org.codehaus.plexus:plexus-utils:jar:1.5.8' in repository
central (http://repo1.maven.org/maven2)
[INFO] Downloading: http://repo2.maven.org/maven2/org/codehaus/plexus/plexus-utils/1.5.8/plexus-utils-1.5.8.jar
[INFO] 
[INFO] [INFO] Unable to find resource 'org.beanshell:bsh:jar:2.0b4' in repository central
(http://repo1.maven.org/maven2)
[INFO] 
[INFO] [INFO] ------------------------------------------------------------------------
[INFO] [ERROR] BUILD ERROR
--
[INFO]   org.apache.maven.plugins:maven-enforcer-plugin:maven-plugin:1.0-beta-1
[INFO] 
[INFO] from the specified remote repositories:
[INFO]   codehaus.snapshots (http://snapshots.repository.codehaus.org),
[INFO]   ibiblio.org (http://repo2.maven.org/maven2),
[INFO]   apache.snapshots (http://repository.apache.org/snapshots)
[INFO] 
[INFO] 
[INFO] 
[INFO] [INFO] ------------------------------------------------------------------------
[INFO] [INFO] Trace
[INFO] org.apache.maven.lifecycle.LifecycleExecutionException: Missing:
[INFO] ----------
[INFO] 1) org.beanshell:bsh:jar:2.0b4
[INFO] 
[INFO]   Try downloading the file manually from the project website.
[INFO] 
[INFO]   Then, install it using the command: 
[INFO]       mvn install:install-file -DgroupId=org.beanshell -DartifactId=bsh -Dversion=2.0b4
-Dpackaging=jar -Dfile=/path/to/file
[INFO] 
[INFO]   Alternatively, if you host your own repository you can deploy the file there: 
[INFO]       mvn deploy:deploy-file -DgroupId=org.beanshell -DartifactId=bsh -Dversion=2.0b4
-Dpackaging=jar -Dfile=/path/to/file -Durl=[url] -DrepositoryId=[id]
[INFO] 
[INFO]   Path to dependency: 
[INFO]   	1) org.apache.maven.plugins:maven-enforcer-plugin:maven-plugin:1.0-beta-1
[INFO]   	2) org.apache.maven.enforcer:enforcer-rules:jar:1.0-beta-1
[INFO]   	3) org.beanshell:bsh:jar:2.0b4
[INFO] 
[INFO] ----------
[INFO] 1 required artifact is missing.
[INFO] 
[INFO] for artifact: 
[INFO]   org.apache.maven.plugins:maven-enforcer-plugin:maven-plugin:1.0-beta-1
[INFO] 
[INFO] from the specified remote repositories:
[INFO]   codehaus.snapshots (http://snapshots.repository.codehaus.org),
[INFO]   ibiblio.org (http://repo2.maven.org/maven2),
[INFO]   apache.snapshots (http://repository.apache.org/snapshots)
[INFO] 
[INFO] 
[INFO] 	at org.apache.maven.lifecycle.DefaultLifecycleExecutor.executeGoals(DefaultLifecycleExecutor.java:711)
[INFO] 	at org.apache.maven.lifecycle.DefaultLifecycleExecutor.executeGoalWithLifecycle(DefaultLifecycleExecutor.java:556)
[INFO] 	at org.apache.maven.lifecycle.DefaultLifecycleExecutor.executeGoal(DefaultLifecycleExecutor.java:535)
[INFO] 	at org.apache.maven.lifecycle.DefaultLifecycleExecutor.executeGoalAndHandleFailures(DefaultLifecycleExecutor.java:387)
[INFO] 	at org.apache.maven.lifecycle.DefaultLifecycleExecutor.executeTaskSegments(DefaultLifecycleExecutor.java:348)
[INFO] 	at org.apache.maven.lifecycle.DefaultLifecycleExecutor.execute(DefaultLifecycleExecutor.java:180)
[INFO] 	at org.apache.maven.DefaultMaven.doExecute(DefaultMaven.java:328)
[INFO] 	at org.apache.maven.DefaultMaven.execute(DefaultMaven.java:138)
[INFO] 	at org.apache.maven.cli.MavenCli.main(MavenCli.java:362)
[INFO] 	at org.apache.maven.cli.compat.CompatibleMain.main(CompatibleMain.java:60)
[INFO] 	at sun.reflect.NativeMethodAccessorImpl.invoke0(Native Method)
[INFO] 	at sun.reflect.NativeMethodAccessorImpl.invoke(NativeMethodAccessorImpl.java:39)
[INFO] 	at sun.reflect.DelegatingMethodAccessorImpl.invoke(DelegatingMethodAccessorImpl.java:25)
[INFO] 	at java.lang.reflect.Method.invoke(Method.java:592)
[INFO] 	at org.codehaus.classworlds.Launcher.launchEnhanced(Launcher.java:315)
[INFO] 	at org.codehaus.classworlds.Launcher.launch(Launcher.java:255)
[INFO] 	at org.codehaus.classworlds.Launcher.mainWithExitCode(Launcher.java:430)
[INFO] 	at org.codehaus.classworlds.Launcher.main(Launcher.java:375)
[INFO] Caused by: org.apache.maven.artifact.resolver.MultipleArtifactsNotFoundException: Missing:
[INFO] ----------
[INFO] 1) org.beanshell:bsh:jar:2.0b4
[INFO] 
[INFO]   Try downloading the file manually from the project website.
[INFO] 
[INFO]   Then, install it using the command: 
[INFO]       mvn install:install-file -DgroupId=org.beanshell -DartifactId=bsh -Dversion=2.0b4
-Dpackaging=jar -Dfile=/path/to/file
[INFO] 
[INFO]   Alternatively, if you host your own repository you can deploy the file there: 
[INFO]       mvn deploy:deploy-file -DgroupId=org.beanshell -DartifactId=bsh -Dversion=2.0b4
-Dpackaging=jar -Dfile=/path/to/file -Durl=[url] -DrepositoryId=[id]
[INFO] 
[INFO]   Path to dependency: 
[INFO]   	1) org.apache.maven.plugins:maven-enforcer-plugin:maven-plugin:1.0-beta-1
[INFO]   	2) org.apache.maven.enforcer:enforcer-rules:jar:1.0-beta-1
[INFO]   	3) org.beanshell:bsh:jar:2.0b4
[INFO] 
[INFO] ----------
[INFO] 1 required artifact is missing.
[INFO] 
[INFO] for artifact: 
[INFO]   org.apache.maven.plugins:maven-enforcer-plugin:maven-plugin:1.0-beta-1
[INFO] 
[INFO] from the specified remote repositories:
[INFO]   codehaus.snapshots (http://snapshots.repository.codehaus.org),
[INFO]   ibiblio.org (http://repo2.maven.org/maven2),
[INFO]   apache.snapshots (http://repository.apache.org/snapshots)
[INFO] 
[INFO] 
[INFO] 	at org.apache.maven.artifact.resolver.DefaultArtifactResolver.resolveTransitively(DefaultArtifactResolver.java:360)
[INFO] 	at org.apache.maven.artifact.resolver.DefaultArtifactResolver.resolveTransitively(DefaultArtifactResolver.java:304)
[INFO] 	at org.apache.maven.plugin.DefaultPluginManager.ensurePluginContainerIsComplete(DefaultPluginManager.java:835)
[INFO] 	at org.apache.maven.plugin.DefaultPluginManager.getConfiguredMojo(DefaultPluginManager.java:647)
[INFO] 	at org.apache.maven.plugin.DefaultPluginManager.executeMojo(DefaultPluginManager.java:468)
[INFO] 	at org.apache.maven.lifecycle.DefaultLifecycleExecutor.executeGoals(DefaultLifecycleExecutor.java:694)
[INFO] 	... 17 more
[INFO] [INFO] ------------------------------------------------------------------------
[INFO] [INFO] Total time: 1 minute 53 seconds
[INFO] [INFO] Finished at: Sat Jun 18 20:01:58 EDT 2011
[INFO] [INFO] Final Memory: 22M/561M
[INFO] [INFO] ------------------------------------------------------------------------
[INFO] ------------------------------------------------------------------------
[ERROR] BUILD ERROR
 
Samples: branches/2.1
=================================
Log: http://people.apache.org/builds/geronimo/server/binaries/2.1/20110618/samples-0200.log
 
Build status: FAILED
 

Mime
View raw message