geronimo-dev mailing list archives

Site index · List index
Message view « Date » · « Thread »
Top « Date » · « Thread »
From ga...@apache.org (Jarek Gawor)
Subject [BUILD] branches/2.1: Failed for Revision: 1136761
Date Fri, 17 Jun 2011 11:19:09 GMT
Geronimo Revision: 1136761 built with tests included
 
See the full build-0200.log file at http://people.apache.org/builds/geronimo/server/binaries/2.1/20110617/build-0200.log
 
Download the binaries from http://people.apache.org/builds/geronimo/server/binaries/2.1/20110617
[INFO] BUILD SUCCESSFUL
[INFO] ------------------------------------------------------------------------
[INFO] Total time: 263 minutes 26 seconds
[INFO] Finished at: Fri Jun 17 06:27:14 EDT 2011
[INFO] Final Memory: 314M/821M
[INFO] ------------------------------------------------------------------------
 
TESTSUITE RESULTS (Failures only)
=================================
 
Assembly: tomcat
=================================
See full test results and logs at http://people.apache.org/builds/geronimo/server/binaries/2.1/20110617/logs-0200-tomcat/
 
[INFO] Running security-testsuite.security
[INFO] Tests run: 36, Failures: 1, Errors: 0, Skipped: 0, Time elapsed: 59.836 sec <<<
FAILURE!
 
Assembly: jetty
=================================
See full test results and logs at http://people.apache.org/builds/geronimo/server/binaries/2.1/20110617/logs-0200-jetty/
 
[INFO] Running security-testsuite-generic-auth-test
[INFO] Tests run: 4, Failures: 3, Errors: 0, Skipped: 0, Time elapsed: 0.477 sec <<<
FAILURE!
 
Samples: branches/2.1
=================================
Log: http://people.apache.org/builds/geronimo/server/binaries/2.1/20110617/samples-0200.log
 
Build status: FAILED
 

Mime
View raw message