geronimo-dev mailing list archives

Site index · List index
Message view « Date » · « Thread »
Top « Date » · « Thread »
From ga...@apache.org (Jarek Gawor)
Subject [BUILD] branches/2.1: Failed for Revision: 1134521
Date Sat, 11 Jun 2011 12:04:58 GMT
Geronimo Revision: 1134521 built with tests included
 
See the full build-0200.log file at http://people.apache.org/builds/geronimo/server/binaries/2.1/20110611/build-0200.log
 
Download the binaries from http://people.apache.org/builds/geronimo/server/binaries/2.1/20110611
[INFO] BUILD SUCCESSFUL
[INFO] ------------------------------------------------------------------------
[INFO] Total time: 263 minutes 34 seconds
[INFO] Finished at: Sat Jun 11 06:36:56 EDT 2011
[INFO] Final Memory: 310M/827M
[INFO] ------------------------------------------------------------------------
 
TESTSUITE RESULTS (Failures only)
=================================
 
Assembly: tomcat
=================================
See full test results and logs at http://people.apache.org/builds/geronimo/server/binaries/2.1/20110611/logs-0200-tomcat/
 
[INFO] Running security-testsuite.security
[INFO] Tests run: 36, Failures: 1, Errors: 0, Skipped: 0, Time elapsed: 60.187 sec <<<
FAILURE!
 
Assembly: jetty
=================================
See full test results and logs at http://people.apache.org/builds/geronimo/server/binaries/2.1/20110611/logs-0200-jetty/
 
 
[INFO] [INFO] Stopping module: JEE5/JAXRPC-JAXWS/1.1/car
[INFO] [INFO] Stopped module(s):
[INFO] [INFO]     [0] JEE5/JAXRPC-JAXWS/1.1/car; URL: /jaxrpc-jaxws-war-2.1.8-SNAPSHOT
[INFO] [INFO] Undeploying module: JEE5/JAXRPC-JAXWS/1.1/car
[INFO] [INFO] Undeployed module(s):
[INFO] [INFO]     [0] JEE5/JAXRPC-JAXWS/1.1/car
[INFO] [INFO] [ianal:verify-legal-files {execution: default}]
[INFO] [WARNING] Skipping verification of legal files in artifacts:
[INFO] [WARNING]     org.apache.geronimo.testsuite:jaxrpc-jaxws-war:war:2.1.8-SNAPSHOT
[INFO] [INFO] [install:install {execution: default-install}]
[INFO] [INFO] Installing /home/geronimo/geronimo/2.1/testsuite/webservices-testsuite/jaxrpc-jaxws-tests/jaxrpc-jaxws-war/target/jaxrpc-jaxws-war-2.1.8-SNAPSHOT.war
to /home/geronimo/.m2/repository/org/apache/geronimo/testsuite/jaxrpc-jaxws-war/2.1.8-SNAPSHOT/jaxrpc-jaxws-war-2.1.8-SNAPSHOT.war
[INFO] [INFO] [testsuite:generate-surefire-xml {execution: generate-surefire-xml}]
[INFO] [INFO] Updating directory: /home/geronimo/geronimo/2.1/testsuite/webservices-testsuite/target/surefire-reports
[INFO] [INFO] Loading surefire xml for xmlproperty: /home/geronimo/geronimo/2.1/testsuite/webservices-testsuite/jaxrpc-jaxws-tests/jaxrpc-jaxws-war/target/surefire-reports/TEST-org.apache.geronimo.testsuite.testset.WSTest.xml
[INFO] [INFO] Loading surefire xml for xmlproperty: /home/geronimo/geronimo/2.1/testsuite/webservices-testsuite/jaxrpc-jaxws-tests/jaxrpc-jaxws-war/target/surefire-reports/TEST-org.apache.geronimo.mavenplugins.geronimo.module.DeployModuleMojo.xml
[INFO] [INFO] Loading parent surefire xml for xmlproperty: /home/geronimo/geronimo/2.1/testsuite/webservices-testsuite/target/surefire-reports/TEST-jaxrpc-jaxws-war.xml
[INFO] [INFO] Loading surefire xml for xmlproperty: /home/geronimo/geronimo/2.1/testsuite/webservices-testsuite/jaxrpc-jaxws-tests/jaxrpc-jaxws-war/target/surefire-reports/TEST-org.apache.geronimo.mavenplugins.geronimo.module.UndeployModuleMojo.xml
[INFO] [INFO] Loading parent surefire xml for xmlproperty: /home/geronimo/geronimo/2.1/testsuite/webservices-testsuite/target/surefire-reports/TEST-jaxrpc-jaxws-war.xml
[INFO] [INFO] 
[INFO] [INFO] 
[INFO] [INFO] ------------------------------------------------------------------------
[INFO] [INFO] Reactor Summary:
[INFO] [INFO] ------------------------------------------------------------------------
[INFO] [INFO] Geronimo TestSuite :: WebServices TestSuite :: JAX-RPC - JAX-WS  SUCCESS [8.040s]
[INFO] [INFO] Geronimo TestSuite :: WebServices TestSuite :: JAX-RPC - JAX-WS WAR  SUCCESS
[16.149s]
[INFO] [INFO] ------------------------------------------------------------------------
[INFO] [INFO] ------------------------------------------------------------------------
[INFO] [INFO] BUILD SUCCESSFUL
[INFO] [INFO] ------------------------------------------------------------------------
[INFO] [INFO] Total time: 25 seconds
[INFO] [INFO] Finished at: Sat Jun 11 07:59:54 EDT 2011
[INFO] [INFO] Final Memory: 47M/551M
[INFO] [INFO] ------------------------------------------------------------------------
[INFO] Invoking: /home/geronimo/geronimo/2.1/testsuite/webservices-testsuite/jaxb-tests/pom.xml
[INFO] + Error stacktraces are turned on.
[INFO] [INFO] Scanning for projects...
[INFO] [INFO] Reactor build order: 
[INFO] [INFO]   Geronimo TestSuite :: WebServices TestSuite :: JAXB
[INFO] [INFO]   Geronimo TestSuite :: WebServices TestSuite :: JAXB WAR
[INFO] [INFO]   Geronimo TestSuite :: WebServices TestSuite :: JAXB EJB
[INFO] [INFO]   Geronimo TestSuite :: WebServices TestSuite :: JAXB Client
[INFO] [INFO] ------------------------------------------------------------------------
[INFO] [INFO] Building Geronimo TestSuite :: WebServices TestSuite :: JAXB
[INFO] [INFO]    task-segment: [install]
[INFO] [INFO] ------------------------------------------------------------------------
[INFO] [INFO] [genesis:validate-configuration {execution: default}]
[INFO] [INFO] [enforcer:enforce {execution: default}]
[INFO] [INFO] Setting property: classpath.resource.loader.class => 'org.codehaus.plexus.velocity.ContextClassLoaderResourceLoader'.
[INFO] [INFO] Setting property: velocimacro.messages.on => 'false'.
[INFO] [INFO] Setting property: resource.loader => 'classpath'.
[INFO] [INFO] Setting property: resource.manager.logwhenfound => 'false'.
[INFO] [INFO] [remote-resources:process {execution: default}]
[INFO] [INFO] [site:attach-descriptor {execution: default-attach-descriptor}]
[INFO] [INFO] [ianal:verify-legal-files {execution: default}]
[INFO] [INFO] [install:install {execution: default-install}]
[INFO] [INFO] Installing /home/geronimo/geronimo/2.1/testsuite/webservices-testsuite/jaxb-tests/pom.xml
to /home/geronimo/.m2/repository/org/apache/geronimo/testsuite/jaxb-tests/2.1.8-SNAPSHOT/jaxb-tests-2.1.8-SNAPSHOT.pom
[INFO] [INFO] [testsuite:generate-surefire-xml {execution: generate-surefire-xml}]
[INFO] [INFO] Updating directory: /home/geronimo/geronimo/2.1/testsuite/webservices-testsuite/target/surefire-reports
[INFO] [INFO] No surefire-reports directory here
[INFO] [INFO] ------------------------------------------------------------------------
[INFO] [INFO] Building Geronimo TestSuite :: WebServices TestSuite :: JAXB WAR
[INFO] [INFO]    task-segment: [install]
[INFO] [INFO] ------------------------------------------------------------------------
[INFO] [INFO] [genesis:validate-configuration {execution: default}]
[INFO] [INFO] [enforcer:enforce {execution: default}]
[INFO] [INFO] [remote-resources:process {execution: default}]
[INFO] [INFO] [resources:resources {execution: default-resources}]
[INFO] [INFO] Using 'UTF-8' encoding to copy filtered resources.
[INFO] [INFO] skip non existing resourceDirectory /home/geronimo/geronimo/2.1/testsuite/webservices-testsuite/jaxb-tests/jaxb-war/src/main/resources
[INFO] [INFO] Copying 3 resources
[INFO] [INFO] [compiler:compile {execution: default-compile}]
[INFO] [INFO] Compiling 5 source files to /home/geronimo/geronimo/2.1/testsuite/webservices-testsuite/jaxb-tests/jaxb-war/target/classes
[INFO] [INFO] [resources:testResources {execution: default-testResources}]
[INFO] [INFO] Using 'UTF-8' encoding to copy filtered resources.
[INFO] [INFO] skip non existing resourceDirectory /home/geronimo/geronimo/2.1/testsuite/webservices-testsuite/jaxb-tests/jaxb-war/src/test/resources
[INFO] [INFO] skip non existing resourceDirectory /home/geronimo/geronimo/2.1/testsuite/webservices-testsuite/jaxb-tests/jaxb-war/src/test/filtered-resources
[INFO] [INFO] Copying 3 resources
[INFO] [INFO] [compiler:testCompile {execution: default-testCompile}]
[INFO] [INFO] Compiling 1 source file to /home/geronimo/geronimo/2.1/testsuite/webservices-testsuite/jaxb-tests/jaxb-war/target/test-classes
[INFO] [INFO] [surefire:test {execution: default-test}]
[INFO] [INFO] Tests are skipped.
[INFO] [INFO] [surefire:test {execution: test}]
[INFO] [INFO] Tests are skipped.
[INFO] [INFO] [war:war {execution: default-war}]
[INFO] [INFO] Exploding webapp...
[INFO] [INFO] Assembling webapp jaxb-war in /home/geronimo/geronimo/2.1/testsuite/webservices-testsuite/jaxb-tests/jaxb-war/target/jaxb-war-2.1.8-SNAPSHOT
[INFO] [INFO] Copy webapp webResources to /home/geronimo/geronimo/2.1/testsuite/webservices-testsuite/jaxb-tests/jaxb-war/target/jaxb-war-2.1.8-SNAPSHOT
[INFO] [INFO] Copy webapp webResources to /home/geronimo/geronimo/2.1/testsuite/webservices-testsuite/jaxb-tests/jaxb-war/target/jaxb-war-2.1.8-SNAPSHOT
[INFO] [INFO] Copy webapp webResources to /home/geronimo/geronimo/2.1/testsuite/webservices-testsuite/jaxb-tests/jaxb-war/target/jaxb-war-2.1.8-SNAPSHOT
[INFO] [INFO] Building jar: /home/geronimo/geronimo/2.1/testsuite/webservices-testsuite/jaxb-tests/jaxb-war/target/jaxb-war-2.1.8-SNAPSHOT/WEB-INF/lib/jaxb-war-2.1.8-SNAPSHOT.jar
[INFO] [INFO] Generating war /home/geronimo/geronimo/2.1/testsuite/webservices-testsuite/jaxb-tests/jaxb-war/target/jaxb-war-2.1.8-SNAPSHOT.war
[INFO] [INFO] Building war: /home/geronimo/geronimo/2.1/testsuite/webservices-testsuite/jaxb-tests/jaxb-war/target/jaxb-war-2.1.8-SNAPSHOT.war
[INFO] Downloading: http://repo2.maven.org/maven2/woodstox/wstx-asl/3.2.1/wstx-asl-3.2.1.pom
[INFO] [INFO] Unable to find resource 'woodstox:wstx-asl:pom:3.2.1' in repository central
(http://repo1.maven.org/maven2)
[INFO] Downloading: http://repo2.maven.org/maven2/javax/activation/activation/1.1/activation-1.1.jar
[INFO] Downloading: http://repo2.maven.org/maven2/javax/xml/bind/jaxb-api/2.0/jaxb-api-2.0.jar
[INFO] [WARNING] Unable to get resource 'javax.activation:activation:jar:1.1' from repository
central (http://repo1.maven.org/maven2): GET request of: javax/activation/activation/1.1/activation-1.1.jar
from ibiblio.org failed
[INFO] 
[INFO] [INFO] Unable to find resource 'javax.xml.bind:jaxb-api:jar:2.0' in repository central
(http://repo1.maven.org/maven2)
[INFO] [INFO] ------------------------------------------------------------------------
[INFO] [ERROR] BUILD ERROR
--
[INFO]   Alternatively, if you host your own repository you can deploy the file there: 
[INFO]       mvn deploy:deploy-file -DgroupId=javax.xml.bind -DartifactId=jaxb-api -Dversion=2.0
-Dpackaging=jar -Dfile=/path/to/file -Durl=[url] -DrepositoryId=[id]
[INFO] 
[INFO]   Path to dependency: 
[INFO]   	1) org.apache.geronimo.buildsupport:geronimo-maven-plugin:maven-plugin:2.1.8-SNAPSHOT
[INFO]   	2) org.apache.geronimo.framework:geronimo-deploy-jsr88:jar:2.1.8-SNAPSHOT
[INFO]   	3) org.apache.geronimo.framework:geronimo-system:jar:2.1.8-SNAPSHOT
[INFO]   	4) javax.xml.bind:jaxb-api:jar:2.0
[INFO] 
[INFO] ----------
[INFO] 2 required artifacts are missing.
[INFO] 
[INFO] for artifact: 
[INFO]   org.apache.geronimo.buildsupport:geronimo-maven-plugin:maven-plugin:2.1.8-SNAPSHOT
[INFO] 
[INFO] from the specified remote repositories:
[INFO]   codehaus.snapshots (http://snapshots.repository.codehaus.org),
[INFO]   ibiblio.org (http://repo2.maven.org/maven2),
[INFO]   apache.snapshots (http://repository.apache.org/snapshots)
[INFO] 
[INFO] 
[INFO] 	at org.apache.maven.lifecycle.DefaultLifecycleExecutor.executeGoals(DefaultLifecycleExecutor.java:711)
[INFO] 	at org.apache.maven.lifecycle.DefaultLifecycleExecutor.executeGoalWithLifecycle(DefaultLifecycleExecutor.java:556)
[INFO] 	at org.apache.maven.lifecycle.DefaultLifecycleExecutor.executeGoal(DefaultLifecycleExecutor.java:535)
[INFO] 	at org.apache.maven.lifecycle.DefaultLifecycleExecutor.executeGoalAndHandleFailures(DefaultLifecycleExecutor.java:387)
[INFO] 	at org.apache.maven.lifecycle.DefaultLifecycleExecutor.executeTaskSegments(DefaultLifecycleExecutor.java:348)
[INFO] 	at org.apache.maven.lifecycle.DefaultLifecycleExecutor.execute(DefaultLifecycleExecutor.java:180)
[INFO] 	at org.apache.maven.DefaultMaven.doExecute(DefaultMaven.java:328)
[INFO] 	at org.apache.maven.DefaultMaven.execute(DefaultMaven.java:138)
[INFO] 	at org.apache.maven.cli.MavenCli.main(MavenCli.java:362)
[INFO] 	at org.apache.maven.cli.compat.CompatibleMain.main(CompatibleMain.java:60)
[INFO] 	at sun.reflect.NativeMethodAccessorImpl.invoke0(Native Method)
[INFO] 	at sun.reflect.NativeMethodAccessorImpl.invoke(NativeMethodAccessorImpl.java:39)
[INFO] 	at sun.reflect.DelegatingMethodAccessorImpl.invoke(DelegatingMethodAccessorImpl.java:25)
[INFO] 	at java.lang.reflect.Method.invoke(Method.java:592)
[INFO] 	at org.codehaus.classworlds.Launcher.launchEnhanced(Launcher.java:315)
[INFO] 	at org.codehaus.classworlds.Launcher.launch(Launcher.java:255)
[INFO] 	at org.codehaus.classworlds.Launcher.mainWithExitCode(Launcher.java:430)
[INFO] 	at org.codehaus.classworlds.Launcher.main(Launcher.java:375)
[INFO] Caused by: org.apache.maven.artifact.resolver.MultipleArtifactsNotFoundException: Missing:
[INFO] ----------
[INFO] 1) javax.activation:activation:jar:1.1
[INFO] 
[INFO]   Try downloading the file manually from: 
[INFO]       https://maven-repository.dev.java.net/nonav/repository/javax.activation/jars/activation-1.1.jar
[INFO] 
[INFO]   Then, install it using the command: 
[INFO]       mvn install:install-file -DgroupId=javax.activation -DartifactId=activation -Dversion=1.1
-Dpackaging=jar -Dfile=/path/to/file
[INFO] 
[INFO]   Alternatively, if you host your own repository you can deploy the file there: 
[INFO]       mvn deploy:deploy-file -DgroupId=javax.activation -DartifactId=activation -Dversion=1.1
-Dpackaging=jar -Dfile=/path/to/file -Durl=[url] -DrepositoryId=[id]
[INFO] 
[INFO]   Path to dependency: 
[INFO]   	1) org.apache.geronimo.buildsupport:geronimo-maven-plugin:maven-plugin:2.1.8-SNAPSHOT
[INFO]   	2) org.apache.geronimo.framework:geronimo-deploy-jsr88:jar:2.1.8-SNAPSHOT
[INFO]   	3) org.apache.geronimo.framework:geronimo-system:jar:2.1.8-SNAPSHOT
[INFO]   	4) javax.xml.bind:jaxb-api:jar:2.0
[INFO]   	5) javax.activation:activation:jar:1.1
[INFO] 
[INFO] 2) javax.xml.bind:jaxb-api:jar:2.0
[INFO] 
[INFO]   Try downloading the file manually from the project website.
[INFO] 
[INFO]   Then, install it using the command: 
[INFO]       mvn install:install-file -DgroupId=javax.xml.bind -DartifactId=jaxb-api -Dversion=2.0
-Dpackaging=jar -Dfile=/path/to/file
[INFO] 
[INFO]   Alternatively, if you host your own repository you can deploy the file there: 
[INFO]       mvn deploy:deploy-file -DgroupId=javax.xml.bind -DartifactId=jaxb-api -Dversion=2.0
-Dpackaging=jar -Dfile=/path/to/file -Durl=[url] -DrepositoryId=[id]
[INFO] 
[INFO]   Path to dependency: 
[INFO]   	1) org.apache.geronimo.buildsupport:geronimo-maven-plugin:maven-plugin:2.1.8-SNAPSHOT
[INFO]   	2) org.apache.geronimo.framework:geronimo-deploy-jsr88:jar:2.1.8-SNAPSHOT
[INFO]   	3) org.apache.geronimo.framework:geronimo-system:jar:2.1.8-SNAPSHOT
[INFO]   	4) javax.xml.bind:jaxb-api:jar:2.0
[INFO] 
[INFO] ----------
[INFO] 2 required artifacts are missing.
[INFO] 
[INFO] for artifact: 
[INFO]   org.apache.geronimo.buildsupport:geronimo-maven-plugin:maven-plugin:2.1.8-SNAPSHOT
[INFO] 
[INFO] from the specified remote repositories:
[INFO]   codehaus.snapshots (http://snapshots.repository.codehaus.org),
[INFO]   ibiblio.org (http://repo2.maven.org/maven2),
[INFO]   apache.snapshots (http://repository.apache.org/snapshots)
[INFO] 
[INFO] 
[INFO] 	at org.apache.maven.artifact.resolver.DefaultArtifactResolver.resolveTransitively(DefaultArtifactResolver.java:360)
[INFO] 	at org.apache.maven.artifact.resolver.DefaultArtifactResolver.resolveTransitively(DefaultArtifactResolver.java:304)
[INFO] 	at org.apache.maven.plugin.DefaultPluginManager.ensurePluginContainerIsComplete(DefaultPluginManager.java:835)
[INFO] 	at org.apache.maven.plugin.DefaultPluginManager.getConfiguredMojo(DefaultPluginManager.java:647)
[INFO] 	at org.apache.maven.plugin.DefaultPluginManager.executeMojo(DefaultPluginManager.java:468)
[INFO] 	at org.apache.maven.lifecycle.DefaultLifecycleExecutor.executeGoals(DefaultLifecycleExecutor.java:694)
[INFO] 	... 17 more
[INFO] [INFO] ------------------------------------------------------------------------
[INFO] [INFO] Total time: 25 seconds
[INFO] [INFO] Finished at: Sat Jun 11 08:00:20 EDT 2011
[INFO] [INFO] Final Memory: 43M/536M
[INFO] [INFO] ------------------------------------------------------------------------
[INFO] ------------------------------------------------------------------------
[ERROR] BUILD ERROR
 
Samples: branches/2.1
=================================
Log: http://people.apache.org/builds/geronimo/server/binaries/2.1/20110611/samples-0200.log
 
Build status: FAILED
 

Mime
View raw message