geronimo-dev mailing list archives

Site index · List index
Message view « Date » · « Thread »
Top « Date » · « Thread »
From ga...@apache.org (Jarek Gawor)
Subject [BUILD] branches/2.1: Failed for Revision: 1134189
Date Fri, 10 Jun 2011 11:18:29 GMT
Geronimo Revision: 1134189 built with tests included
 
See the full build-0200.log file at http://people.apache.org/builds/geronimo/server/binaries/2.1/20110610/build-0200.log
 
Download the binaries from http://people.apache.org/builds/geronimo/server/binaries/2.1/20110610
[INFO] BUILD SUCCESSFUL
[INFO] ------------------------------------------------------------------------
[INFO] Total time: 262 minutes 11 seconds
[INFO] Finished at: Fri Jun 10 06:27:15 EDT 2011
[INFO] Final Memory: 313M/828M
[INFO] ------------------------------------------------------------------------
 
TESTSUITE RESULTS (Failures only)
=================================
 
Assembly: tomcat
=================================
See full test results and logs at http://people.apache.org/builds/geronimo/server/binaries/2.1/20110610/logs-0200-tomcat/
 
[INFO] Running security-testsuite.security
[INFO] Tests run: 36, Failures: 1, Errors: 0, Skipped: 0, Time elapsed: 59.961 sec <<<
FAILURE!
 
Assembly: jetty
=================================
See full test results and logs at http://people.apache.org/builds/geronimo/server/binaries/2.1/20110610/logs-0200-jetty/
 
[INFO] Running security-testsuite-generic-auth-test
[INFO] Tests run: 4, Failures: 3, Errors: 0, Skipped: 0, Time elapsed: 0.446 sec <<<
FAILURE!
 
Samples: branches/2.1
=================================
Log: http://people.apache.org/builds/geronimo/server/binaries/2.1/20110610/samples-0200.log
 
Build status: FAILED
 

Mime
View raw message