geronimo-dev mailing list archives

Site index · List index
Message view « Date » · « Thread »
Top « Date » · « Thread »
From ga...@apache.org (Jarek Gawor)
Subject [BUILD] trunk: Failed for Revision: 1133264
Date Wed, 08 Jun 2011 10:32:03 GMT
Geronimo Revision: 1133264 built with tests included
 
See the full build-0300.log file at http://people.apache.org/builds/geronimo/server/binaries/trunk/20110608/build-0300.log
 
 
See the unit test reports at http://people.apache.org/builds/geronimo/server/binaries/trunk/20110608/unit-test-reports
 

[INFO] snapshot org.apache.geronimo.specs:geronimo-jaxws_2.2_spec:1.1-SNAPSHOT: checking for
updates from local
[INFO] snapshot org.apache.geronimo.specs:geronimo-jaxws_2.2_spec:1.1-SNAPSHOT: checking for
updates from jetty.oss.sonatype.org
[INFO] snapshot org.apache.geronimo.specs:geronimo-jaxws_2.2_spec:1.1-SNAPSHOT: checking for
updates from openqa-snapshots
[INFO] snapshot org.apache.geronimo.specs:geronimo-jaxws_2.2_spec:1.1-SNAPSHOT: checking for
updates from codehaus.snapshots
[INFO] snapshot org.apache.geronimo.specs:geronimo-jaxws_2.2_spec:1.1-SNAPSHOT: checking for
updates from apache.snapshots
Downloading: http://repository.apache.org/snapshots/org/apache/geronimo/specs/geronimo-jaxws_2.2_spec/1.1-SNAPSHOT/geronimo-jaxws_2.2_spec-1.1-20110608.070936-7.pom
4K downloaded  (geronimo-jaxws_2.2_spec-1.1-20110608.070936-7.pom)
[INFO] snapshot org.apache.geronimo.modules:geronimo-j2ee-schema:3.0-SNAPSHOT: checking for
updates from jetty.oss.sonatype.org
Downloading: http://repository.apache.org/snapshots/org/apache/openejb/openejb-jee/4.0.0-SNAPSHOT/openejb-jee-4.0.0-20110608.103844-107.jar
Downloading: file:///home/geronimo/.m2/jtidy.repository/org/apache/geronimo/specs/geronimo-jpa_2.0_spec/1.1/geronimo-jpa_2.0_spec-1.1.jar
[INFO] Unable to find resource 'org.apache.geronimo.specs:geronimo-jpa_2.0_spec:jar:1.1' in
repository local (file:///home/geronimo/.m2/jtidy.repository)
Downloading: http://svn.apache.org/repos/asf/geronimo/repo//org/apache/geronimo/specs/geronimo-jpa_2.0_spec/1.1/geronimo-jpa_2.0_spec-1.1.jar
[INFO] snapshot org.apache.geronimo.modules:geronimo-j2ee-schema:3.0-SNAPSHOT: checking for
updates from openqa-snapshots
[INFO] snapshot org.apache.geronimo.modules:geronimo-j2ee-schema:3.0-SNAPSHOT: checking for
updates from codehaus.snapshots
[INFO] Unable to find resource 'org.apache.geronimo.specs:geronimo-jpa_2.0_spec:jar:1.1' in
repository geronimo-svn-repo (http://svn.apache.org/repos/asf/geronimo/repo/)
Downloading: http://oss.sonatype.org/content/groups/jetty-with-staging/org/apache/geronimo/specs/geronimo-jpa_2.0_spec/1.1/geronimo-jpa_2.0_spec-1.1.jar
[INFO] snapshot org.apache.geronimo.modules:geronimo-j2ee-schema:3.0-SNAPSHOT: checking for
updates from apache.snapshots
[INFO] Unable to find resource 'org.apache.geronimo.specs:geronimo-jpa_2.0_spec:jar:1.1' in
repository jetty.oss.sonatype.org (http://oss.sonatype.org/content/groups/jetty-with-staging)
Downloading: http://svn.apache.org/repos/asf/servicemix/m2-repo//org/apache/geronimo/specs/geronimo-jpa_2.0_spec/1.1/geronimo-jpa_2.0_spec-1.1.jar
[INFO] Unable to find resource 'org.apache.geronimo.specs:geronimo-jpa_2.0_spec:jar:1.1' in
repository smx.svn (http://svn.apache.org/repos/asf/servicemix/m2-repo/)
Downloading: http://download.java.net/maven/2//org/apache/geronimo/specs/geronimo-jpa_2.0_spec/1.1/geronimo-jpa_2.0_spec-1.1.jar
[INFO] Unable to find resource 'org.apache.geronimo.specs:geronimo-jpa_2.0_spec:jar:1.1' in
repository java.net2 (http://download.java.net/maven/2/)
Downloading: http://nexus.openqa.org/content/repositories/releases/org/apache/geronimo/specs/geronimo-jpa_2.0_spec/1.1/geronimo-jpa_2.0_spec-1.1.jar
[INFO] Unable to find resource 'org.apache.geronimo.specs:geronimo-jpa_2.0_spec:jar:1.1' in
repository openqa-releases (http://nexus.openqa.org/content/repositories/releases)
Downloading: http://repo2.maven.org/maven2/org/apache/geronimo/specs/geronimo-jpa_2.0_spec/1.1/geronimo-jpa_2.0_spec-1.1.jar
1052K downloaded  (openejb-jee-4.0.0-20110608.103844-107.jar)

Downloading: http://repository.apache.org/snapshots/org/apache/geronimo/specs/geronimo-jaxws_2.2_spec/1.1-SNAPSHOT/geronimo-jaxws_2.2_spec-1.1-20110608.070936-7.jar
58K downloaded  (geronimo-jaxws_2.2_spec-1.1-20110608.070936-7.jar)
[INFO] [enforcer:enforce {execution: default}]
[INFO] [xmlbeans:xmlbeans {execution: default}]
Time to build schema type system: 0.083 seconds
Time to generate code: 0.094 seconds
Time to compile code: 1.519 seconds
[INFO] [remote-resources:process {execution: default}]
[INFO] [resources:resources {execution: default-resources}]
[INFO] Using 'UTF-8' encoding to copy filtered resources.
[INFO] skip non existing resourceDirectory /home/geronimo/geronimo/trunk/plugins/j2ee/geronimo-j2ee-builder/src/main/resources
[INFO] skip non existing resourceDirectory /home/geronimo/geronimo/trunk/plugins/j2ee/geronimo-j2ee-builder/src/main/filtered-resources
[INFO] Copying 77 resources
[INFO] Copying 3 resources
[INFO] [compiler:compile {execution: default-compile}]
[INFO] Compiling 35 source files to /home/geronimo/geronimo/trunk/plugins/j2ee/geronimo-j2ee-builder/target/classes
[INFO] ------------------------------------------------------------------------
[ERROR] BUILD FAILURE
[INFO] ------------------------------------------------------------------------
[INFO] Compilation failure

/home/geronimo/geronimo/trunk/plugins/j2ee/geronimo-j2ee-builder/src/main/java/org/apache/geronimo/j2ee/deployment/annotation/WebServiceRefAnnotationHelper.java:[295,61]
cannot find symbol
symbol  : method lookup()
location: @interface javax.xml.ws.WebServiceRef

/home/geronimo/geronimo/trunk/plugins/j2ee/geronimo-j2ee-builder/src/main/java/org/apache/geronimo/j2ee/deployment/annotation/WebServiceRefAnnotationHelper.java:[296,47]
cannot find symbol
symbol  : method lookup()
location: @interface javax.xml.ws.WebServiceRef

/home/geronimo/geronimo/trunk/plugins/j2ee/geronimo-j2ee-builder/src/main/java/org/apache/geronimo/j2ee/deployment/annotation/WebServiceRefAnnotationHelper.java:[403,104]
cannot find symbol
symbol  : method responses()
location: @interface javax.xml.ws.soap.Addressing

/home/geronimo/geronimo/trunk/plugins/j2ee/geronimo-j2ee-builder/src/main/java/org/apache/geronimo/j2ee/deployment/annotation/WebServiceRefAnnotationHelper.java:[413,108]
cannot find symbol
symbol  : method responses()
location: @interface javax.xml.ws.soap.Addressing

/home/geronimo/geronimo/trunk/plugins/j2ee/geronimo-j2ee-builder/src/main/java/org/apache/geronimo/j2ee/deployment/annotation/HandlerChainAnnotationHelper.java:[178,39]
[deprecation] name() in javax.jws.HandlerChain has been deprecated


[INFO] ------------------------------------------------------------------------
[INFO] Trace
org.apache.maven.BuildFailureException: Compilation failure
	at org.apache.maven.lifecycle.DefaultLifecycleExecutor.executeGoals(DefaultLifecycleExecutor.java:715)
	at org.apache.maven.lifecycle.DefaultLifecycleExecutor.executeGoalWithLifecycle(DefaultLifecycleExecutor.java:556)
	at org.apache.maven.lifecycle.DefaultLifecycleExecutor.executeGoal(DefaultLifecycleExecutor.java:535)
	at org.apache.maven.lifecycle.DefaultLifecycleExecutor.executeGoalAndHandleFailures(DefaultLifecycleExecutor.java:387)
	at org.apache.maven.lifecycle.DefaultLifecycleExecutor.executeTaskSegments(DefaultLifecycleExecutor.java:348)
	at org.apache.maven.lifecycle.DefaultLifecycleExecutor.execute(DefaultLifecycleExecutor.java:180)
	at org.apache.maven.DefaultMaven.doExecute(DefaultMaven.java:328)
	at org.apache.maven.DefaultMaven.execute(DefaultMaven.java:138)
	at org.apache.maven.cli.MavenCli.main(MavenCli.java:362)
	at org.apache.maven.cli.compat.CompatibleMain.main(CompatibleMain.java:60)
	at sun.reflect.NativeMethodAccessorImpl.invoke0(Native Method)
	at sun.reflect.NativeMethodAccessorImpl.invoke(NativeMethodAccessorImpl.java:39)
	at sun.reflect.DelegatingMethodAccessorImpl.invoke(DelegatingMethodAccessorImpl.java:25)
	at java.lang.reflect.Method.invoke(Method.java:597)
	at org.codehaus.classworlds.Launcher.launchEnhanced(Launcher.java:315)
	at org.codehaus.classworlds.Launcher.launch(Launcher.java:255)
	at org.codehaus.classworlds.Launcher.mainWithExitCode(Launcher.java:430)
	at org.codehaus.classworlds.Launcher.main(Launcher.java:375)
Caused by: org.apache.maven.plugin.CompilationFailureException: Compilation failure
	at org.apache.maven.plugin.AbstractCompilerMojo.execute(AbstractCompilerMojo.java:516)
	at org.apache.maven.plugin.CompilerMojo.execute(CompilerMojo.java:114)
	at org.apache.maven.plugin.DefaultPluginManager.executeMojo(DefaultPluginManager.java:490)
	at org.apache.maven.lifecycle.DefaultLifecycleExecutor.executeGoals(DefaultLifecycleExecutor.java:694)
	... 17 more
[INFO] ------------------------------------------------------------------------
[INFO] Total time: 191 minutes 30 seconds
[INFO] Finished at: Wed Jun 08 06:15:13 EDT 2011
[INFO] Final Memory: 243M/750M
[INFO] ------------------------------------------------------------------------

Mime
View raw message