geronimo-dev mailing list archives

Site index · List index
Message view « Date » · « Thread »
Top « Date » · « Thread »
From ga...@apache.org (Jarek Gawor)
Subject [BUILD] branches/2.1: Failed for Revision: 1132863
Date Tue, 07 Jun 2011 23:45:43 GMT
Geronimo Revision: 1132863 built with tests included
 
See the full build-0200.log file at http://people.apache.org/builds/geronimo/server/binaries/2.1/20110607/build-0200.log
 
Download the binaries from http://people.apache.org/builds/geronimo/server/binaries/2.1/20110607
[INFO] BUILD SUCCESSFUL
[INFO] ------------------------------------------------------------------------
[INFO] Total time: 198 minutes 55 seconds
[INFO] Finished at: Tue Jun 07 18:36:32 EDT 2011
[INFO] Final Memory: 309M/837M
[INFO] ------------------------------------------------------------------------
 
TESTSUITE RESULTS (Failures only)
=================================
 
Assembly: tomcat
=================================
See full test results and logs at http://people.apache.org/builds/geronimo/server/binaries/2.1/20110607/logs-0200-tomcat/
 
[INFO] Running security-testsuite.security
[INFO] Tests run: 36, Failures: 1, Errors: 0, Skipped: 0, Time elapsed: 59.891 sec <<<
FAILURE!
 
Assembly: jetty
=================================
See full test results and logs at http://people.apache.org/builds/geronimo/server/binaries/2.1/20110607/logs-0200-jetty/
 
 
[INFO] [INFO] Using 'UTF-8' encoding to copy filtered resources.
[INFO] [INFO] Copying 2 resources
[INFO] [INFO] Copying 3 resources
[INFO] [INFO] [compiler:compile {execution: default-compile}]
[INFO] [INFO] Compiling 7 source files to /home/geronimo/geronimo/2.1/testsuite/webservices-testsuite/jaxb-tests/jaxb-ejb/target/classes
[INFO] [INFO] [resources:testResources {execution: default-testResources}]
[INFO] [INFO] Using 'UTF-8' encoding to copy filtered resources.
[INFO] [INFO] skip non existing resourceDirectory /home/geronimo/geronimo/2.1/testsuite/webservices-testsuite/jaxb-tests/jaxb-ejb/src/test/resources
[INFO] [INFO] skip non existing resourceDirectory /home/geronimo/geronimo/2.1/testsuite/webservices-testsuite/jaxb-tests/jaxb-ejb/src/test/filtered-resources
[INFO] [INFO] Copying 3 resources
[INFO] [INFO] [compiler:testCompile {execution: default-testCompile}]
[INFO] [INFO] Compiling 1 source file to /home/geronimo/geronimo/2.1/testsuite/webservices-testsuite/jaxb-tests/jaxb-ejb/target/test-classes
[INFO] [INFO] [surefire:test {execution: default-test}]
[INFO] [INFO] Tests are skipped.
[INFO] [INFO] [surefire:test {execution: test}]
[INFO] [INFO] Tests are skipped.
[INFO] [INFO] [jar:jar {execution: default-jar}]
[INFO] [INFO] Building jar: /home/geronimo/geronimo/2.1/testsuite/webservices-testsuite/jaxb-tests/jaxb-ejb/target/jaxb-ejb-2.1.8-SNAPSHOT.jar
[INFO] [INFO] [geronimo:deploy-module {execution: deploy-ejb}]
[INFO] [INFO] Using non-artifact based module archive: /home/geronimo/geronimo/2.1/testsuite/webservices-testsuite/jaxb-tests/jaxb-ejb/target/jaxb-ejb-2.1.8-SNAPSHOT.jar
[INFO] [INFO] Distributing module artifact: /home/geronimo/geronimo/2.1/testsuite/webservices-testsuite/jaxb-tests/jaxb-ejb/target/jaxb-ejb-2.1.8-SNAPSHOT.jar
[INFO] [INFO] Starting modules...
[INFO] [INFO] Starting module: JEE5/JAXBEJB/1.1/car
[INFO] [INFO] Started module(s):
[INFO] [INFO]     [0] JEE5/JAXBEJB/1.1/car
[INFO] [INFO] [surefire:test {execution: integration}]
[INFO] [INFO] Surefire report directory: /home/geronimo/geronimo/2.1/testsuite/webservices-testsuite/jaxb-tests/jaxb-ejb/target/surefire-reports
[INFO] 
[INFO] -------------------------------------------------------
[INFO]  T E S T S
[INFO] -------------------------------------------------------
[INFO] Running org.apache.geronimo.testsuite.testset.EJBJAXBTest
[INFO] Tests run: 1, Failures: 0, Errors: 0, Skipped: 0, Time elapsed: 0.253 sec
[INFO] 
[INFO] Results :
[INFO] 
[INFO] Tests run: 1, Failures: 0, Errors: 0, Skipped: 0
[INFO] 
[INFO] [INFO] [geronimo:undeploy-module {execution: undeploy-ejb-as-moduleId}]
[INFO] [INFO] Using non-artifact based module id: JEE5/JAXBEJB/1.1/car
[INFO] [INFO] Stopping module: JEE5/JAXBEJB/1.1/car
[INFO] [INFO] Stopped module(s):
[INFO] [INFO]     [0] JEE5/JAXBEJB/1.1/car
[INFO] [INFO] Undeploying module: JEE5/JAXBEJB/1.1/car
[INFO] [INFO] Undeployed module(s):
[INFO] [INFO]     [0] JEE5/JAXBEJB/1.1/car
[INFO] [INFO] [ianal:verify-legal-files {execution: default}]
[INFO] [WARNING] Skipping verification of legal files in artifacts:
[INFO] [WARNING]     org.apache.geronimo.testsuite:jaxb-ejb:jar:2.1.8-SNAPSHOT
[INFO] [INFO] [install:install {execution: default-install}]
[INFO] [INFO] Installing /home/geronimo/geronimo/2.1/testsuite/webservices-testsuite/jaxb-tests/jaxb-ejb/target/jaxb-ejb-2.1.8-SNAPSHOT.jar
to /home/geronimo/.m2/repository/org/apache/geronimo/testsuite/jaxb-ejb/2.1.8-SNAPSHOT/jaxb-ejb-2.1.8-SNAPSHOT.jar
[INFO] [INFO] [testsuite:generate-surefire-xml {execution: generate-surefire-xml}]
[INFO] [INFO] Updating directory: /home/geronimo/geronimo/2.1/testsuite/webservices-testsuite/target/surefire-reports
[INFO] [INFO] Loading surefire xml for xmlproperty: /home/geronimo/geronimo/2.1/testsuite/webservices-testsuite/jaxb-tests/jaxb-ejb/target/surefire-reports/TEST-org.apache.geronimo.mavenplugins.geronimo.module.DeployModuleMojo.xml
[INFO] [INFO] Loading surefire xml for xmlproperty: /home/geronimo/geronimo/2.1/testsuite/webservices-testsuite/jaxb-tests/jaxb-ejb/target/surefire-reports/TEST-org.apache.geronimo.mavenplugins.geronimo.module.UndeployModuleMojo.xml
[INFO] [INFO] Loading parent surefire xml for xmlproperty: /home/geronimo/geronimo/2.1/testsuite/webservices-testsuite/target/surefire-reports/TEST-jaxb-ejb.xml
[INFO] [INFO] Loading surefire xml for xmlproperty: /home/geronimo/geronimo/2.1/testsuite/webservices-testsuite/jaxb-tests/jaxb-ejb/target/surefire-reports/TEST-org.apache.geronimo.testsuite.testset.EJBJAXBTest.xml
[INFO] [INFO] Loading parent surefire xml for xmlproperty: /home/geronimo/geronimo/2.1/testsuite/webservices-testsuite/target/surefire-reports/TEST-jaxb-ejb.xml
[INFO] [INFO] ------------------------------------------------------------------------
[INFO] [INFO] Building Geronimo TestSuite :: WebServices TestSuite :: JAXB Client
[INFO] [INFO]    task-segment: [install]
[INFO] [INFO] ------------------------------------------------------------------------
[INFO] [INFO] [genesis:validate-configuration {execution: default}]
[INFO] [INFO] [enforcer:enforce {execution: default}]
[INFO] [INFO] [remote-resources:process {execution: default}]
[INFO] [INFO] [resources:resources {execution: default-resources}]
[INFO] [INFO] Using 'UTF-8' encoding to copy filtered resources.
[INFO] [INFO] Copying 2 resources
[INFO] [INFO] Copying 3 resources
[INFO] [INFO] [compiler:compile {execution: default-compile}]
[INFO] [INFO] Compiling 5 source files to /home/geronimo/geronimo/2.1/testsuite/webservices-testsuite/jaxb-tests/jaxb-client/target/classes
[INFO] [INFO] [resources:testResources {execution: default-testResources}]
[INFO] [INFO] Using 'UTF-8' encoding to copy filtered resources.
[INFO] [INFO] skip non existing resourceDirectory /home/geronimo/geronimo/2.1/testsuite/webservices-testsuite/jaxb-tests/jaxb-client/src/test/resources
[INFO] [INFO] skip non existing resourceDirectory /home/geronimo/geronimo/2.1/testsuite/webservices-testsuite/jaxb-tests/jaxb-client/src/test/filtered-resources
[INFO] [INFO] Copying 3 resources
[INFO] [INFO] [compiler:testCompile {execution: default-testCompile}]
[INFO] [INFO] Compiling 1 source file to /home/geronimo/geronimo/2.1/testsuite/webservices-testsuite/jaxb-tests/jaxb-client/target/test-classes
[INFO] [INFO] [surefire:test {execution: default-test}]
[INFO] [INFO] Tests are skipped.
[INFO] [INFO] [surefire:test {execution: test}]
[INFO] [INFO] Tests are skipped.
[INFO] [INFO] [jar:jar {execution: default-jar}]
[INFO] [INFO] Building jar: /home/geronimo/geronimo/2.1/testsuite/webservices-testsuite/jaxb-tests/jaxb-client/target/jaxb-client-2.1.8-SNAPSHOT.jar
[INFO] [INFO] [geronimo:deploy-module {execution: deploy-client}]
[INFO] [INFO] Using non-artifact based module archive: /home/geronimo/geronimo/2.1/testsuite/webservices-testsuite/jaxb-tests/jaxb-client/target/jaxb-client-2.1.8-SNAPSHOT.jar
[INFO] [INFO] Distributing module artifact: /home/geronimo/geronimo/2.1/testsuite/webservices-testsuite/jaxb-tests/jaxb-client/target/jaxb-client-2.1.8-SNAPSHOT.jar
[INFO] [INFO] Starting modules...
[INFO] [INFO] Starting module: JEE5/JAXBClientServer/1.1/car
[INFO] [INFO] Started module(s):
[INFO] [INFO]     [0] JEE5/JAXBClientServer/1.1/car
[INFO] [INFO]         [0] JEE5/JAXBClient/1.1/car
[INFO] [INFO] [geronimo:run-client {execution: run-client}]
[INFO] [INFO] Geronimo Home: /home/geronimo/geronimo/2.1/testsuite/webservices-testsuite/target/geronimo-jetty6-javaee5-2.1.8-SNAPSHOT
[INFO] [INFO] Starting Geronimo client...
[INFO] [INFO] Redirecting output to: /home/geronimo/geronimo/2.1/testsuite/webservices-testsuite/jaxb-tests/jaxb-client/target/client.log
[INFO] Downloading: http://repo2.maven.org/maven2/javax/activation/activation/1.1/activation-1.1.jar
[INFO] 
[INFO] [INFO] Unable to find resource 'javax.activation:activation:jar:1.1' in repository
central (http://repo1.maven.org/maven2)
[INFO] [INFO] ------------------------------------------------------------------------
[INFO] [ERROR] BUILD ERROR
--
[INFO] 
[INFO] from the specified remote repositories:
[INFO]   codehaus.snapshots (http://snapshots.repository.codehaus.org),
[INFO]   ibiblio.org (http://repo2.maven.org/maven2),
[INFO]   apache.snapshots (http://repository.apache.org/snapshots)
[INFO] 
[INFO] 
[INFO] 
[INFO] [INFO] ------------------------------------------------------------------------
[INFO] [INFO] Trace
[INFO] org.apache.maven.lifecycle.LifecycleExecutionException: Missing:
[INFO] ----------
[INFO] 1) javax.activation:activation:jar:1.1
[INFO] 
[INFO]   Try downloading the file manually from: 
[INFO]       https://maven-repository.dev.java.net/nonav/repository/javax.activation/jars/activation-1.1.jar
[INFO] 
[INFO]   Then, install it using the command: 
[INFO]       mvn install:install-file -DgroupId=javax.activation -DartifactId=activation -Dversion=1.1
-Dpackaging=jar -Dfile=/path/to/file
[INFO] 
[INFO]   Alternatively, if you host your own repository you can deploy the file there: 
[INFO]       mvn deploy:deploy-file -DgroupId=javax.activation -DartifactId=activation -Dversion=1.1
-Dpackaging=jar -Dfile=/path/to/file -Durl=[url] -DrepositoryId=[id]
[INFO] 
[INFO]   Path to dependency: 
[INFO]   	1) org.apache.geronimo.testsuite:jaxb-client:jar:2.1.8-SNAPSHOT
[INFO]   	2) javax.xml.bind:jaxb-api:jar:2.0
[INFO]   	3) javax.activation:activation:jar:1.1
[INFO] 
[INFO] ----------
[INFO] 1 required artifact is missing.
[INFO] 
[INFO] for artifact: 
[INFO]   org.apache.geronimo.testsuite:jaxb-client:jar:2.1.8-SNAPSHOT
[INFO] 
[INFO] from the specified remote repositories:
[INFO]   codehaus.snapshots (http://snapshots.repository.codehaus.org),
[INFO]   ibiblio.org (http://repo2.maven.org/maven2),
[INFO]   apache.snapshots (http://repository.apache.org/snapshots)
[INFO] 
[INFO] 
[INFO] 	at org.apache.maven.lifecycle.DefaultLifecycleExecutor.executeGoals(DefaultLifecycleExecutor.java:711)
[INFO] 	at org.apache.maven.lifecycle.DefaultLifecycleExecutor.executeGoalWithLifecycle(DefaultLifecycleExecutor.java:556)
[INFO] 	at org.apache.maven.lifecycle.DefaultLifecycleExecutor.executeGoal(DefaultLifecycleExecutor.java:535)
[INFO] 	at org.apache.maven.lifecycle.DefaultLifecycleExecutor.executeGoalAndHandleFailures(DefaultLifecycleExecutor.java:387)
[INFO] 	at org.apache.maven.lifecycle.DefaultLifecycleExecutor.executeTaskSegments(DefaultLifecycleExecutor.java:348)
[INFO] 	at org.apache.maven.lifecycle.DefaultLifecycleExecutor.execute(DefaultLifecycleExecutor.java:180)
[INFO] 	at org.apache.maven.DefaultMaven.doExecute(DefaultMaven.java:328)
[INFO] 	at org.apache.maven.DefaultMaven.execute(DefaultMaven.java:138)
[INFO] 	at org.apache.maven.cli.MavenCli.main(MavenCli.java:362)
[INFO] 	at org.apache.maven.cli.compat.CompatibleMain.main(CompatibleMain.java:60)
[INFO] 	at sun.reflect.NativeMethodAccessorImpl.invoke0(Native Method)
[INFO] 	at sun.reflect.NativeMethodAccessorImpl.invoke(NativeMethodAccessorImpl.java:39)
[INFO] 	at sun.reflect.DelegatingMethodAccessorImpl.invoke(DelegatingMethodAccessorImpl.java:25)
[INFO] 	at java.lang.reflect.Method.invoke(Method.java:592)
[INFO] 	at org.codehaus.classworlds.Launcher.launchEnhanced(Launcher.java:315)
[INFO] 	at org.codehaus.classworlds.Launcher.launch(Launcher.java:255)
[INFO] 	at org.codehaus.classworlds.Launcher.mainWithExitCode(Launcher.java:430)
[INFO] 	at org.codehaus.classworlds.Launcher.main(Launcher.java:375)
[INFO] Caused by: org.apache.maven.artifact.resolver.MultipleArtifactsNotFoundException: Missing:
[INFO] ----------
[INFO] 1) javax.activation:activation:jar:1.1
[INFO] 
[INFO]   Try downloading the file manually from: 
[INFO]       https://maven-repository.dev.java.net/nonav/repository/javax.activation/jars/activation-1.1.jar
[INFO] 
[INFO]   Then, install it using the command: 
[INFO]       mvn install:install-file -DgroupId=javax.activation -DartifactId=activation -Dversion=1.1
-Dpackaging=jar -Dfile=/path/to/file
[INFO] 
[INFO]   Alternatively, if you host your own repository you can deploy the file there: 
[INFO]       mvn deploy:deploy-file -DgroupId=javax.activation -DartifactId=activation -Dversion=1.1
-Dpackaging=jar -Dfile=/path/to/file -Durl=[url] -DrepositoryId=[id]
[INFO] 
[INFO]   Path to dependency: 
[INFO]   	1) org.apache.geronimo.testsuite:jaxb-client:jar:2.1.8-SNAPSHOT
[INFO]   	2) javax.xml.bind:jaxb-api:jar:2.0
[INFO]   	3) javax.activation:activation:jar:1.1
[INFO] 
[INFO] ----------
[INFO] 1 required artifact is missing.
[INFO] 
[INFO] for artifact: 
[INFO]   org.apache.geronimo.testsuite:jaxb-client:jar:2.1.8-SNAPSHOT
[INFO] 
[INFO] from the specified remote repositories:
[INFO]   codehaus.snapshots (http://snapshots.repository.codehaus.org),
[INFO]   ibiblio.org (http://repo2.maven.org/maven2),
[INFO]   apache.snapshots (http://repository.apache.org/snapshots)
[INFO] 
[INFO] 
[INFO] 	at org.apache.maven.artifact.resolver.DefaultArtifactResolver.resolveTransitively(DefaultArtifactResolver.java:360)
[INFO] 	at org.apache.maven.artifact.resolver.DefaultArtifactResolver.resolveTransitively(DefaultArtifactResolver.java:304)
[INFO] 	at org.apache.maven.plugin.DefaultPluginManager.resolveTransitiveDependencies(DefaultPluginManager.java:1499)
[INFO] 	at org.apache.maven.plugin.DefaultPluginManager.executeMojo(DefaultPluginManager.java:442)
[INFO] 	at org.apache.maven.lifecycle.DefaultLifecycleExecutor.executeGoals(DefaultLifecycleExecutor.java:694)
[INFO] 	... 17 more
[INFO] [INFO] ------------------------------------------------------------------------
[INFO] [INFO] Total time: 58 seconds
[INFO] [INFO] Finished at: Tue Jun 07 20:00:24 EDT 2011
[INFO] [INFO] Final Memory: 55M/551M
[INFO] [INFO] ------------------------------------------------------------------------
[INFO] ------------------------------------------------------------------------
[ERROR] BUILD ERROR
 
Samples: branches/2.1
=================================
Log: http://people.apache.org/builds/geronimo/server/binaries/2.1/20110607/samples-0200.log
 
Build status: FAILED
 

Mime
View raw message