geronimo-dev mailing list archives

Site index · List index
Message view « Date » · « Thread »
Top « Date » · « Thread »
From ga...@apache.org (Jarek Gawor)
Subject [BUILD] branches/2.2: Failed for Revision: 1131284
Date Sat, 04 Jun 2011 07:37:05 GMT
Geronimo Revision: 1131284 built with tests included
 
See the full build-2000.log file at http://people.apache.org/builds/geronimo/server/binaries/2.2/20110604/build-2000.log
 
 
See the unit test reports at http://people.apache.org/builds/geronimo/server/binaries/2.2/20110604/unit-test-reports
 
[INFO] [install:install {execution: default-install}]
[INFO] Installing /home/geronimo/geronimo/2.2/plugins/openjpa/pom.xml to /home/geronimo/.m2/repository/org/apache/geronimo/plugins/openjpa/2.2.2-SNAPSHOT/openjpa-2.2.2-SNAPSHOT.pom
[INFO] ------------------------------------------------------------------------
[INFO] Building Geronimo Plugins, OpenJPA :: Persistence 3.0
[INFO]    task-segment: [install]
[INFO] ------------------------------------------------------------------------
[INFO] [genesis:validate-configuration {execution: default}]
Downloading: http://repo2.maven.org/maven2/org/apache/openjpa/openjpa/1.2.2/openjpa-1.2.2.pom

[WARNING] Component returned which is not the same manager. Ignored. component=org.apache.maven.profiles.activation.AlwaysOnProfileActivator@14b814b8
Downloading: http://repo2.maven.org/maven2/org/apache/openjpa/openjpa-parent/1.2.2/openjpa-parent-1.2.2.pom

[WARNING] Component returned which is not the same manager. Ignored. component=org.apache.maven.profiles.activation.AlwaysOnProfileActivator@14b814b8
[WARNING] Component returned which is not the same manager. Ignored. component=org.apache.maven.profiles.activation.AlwaysOnProfileActivator@14b814b8
[WARNING] Component returned which is not the same manager. Ignored. component=org.apache.maven.profiles.activation.AlwaysOnProfileActivator@14b814b8
[WARNING] Component returned which is not the same manager. Ignored. component=org.apache.maven.profiles.activation.AlwaysOnProfileActivator@14b814b8
[WARNING] Component returned which is not the same manager. Ignored. component=org.apache.maven.profiles.activation.AlwaysOnProfileActivator@14b814b8
Downloading: http://repo2.maven.org/maven2/net/sourceforge/serp/serp/1.11.0/serp-1.11.0.pom

[WARNING] Component returned which is not the same manager. Ignored. component=org.apache.maven.profiles.activation.AlwaysOnProfileActivator@14b814b8
Downloading: http://repo2.maven.org/maven2/org/apache/openjpa/openjpa/1.2.2/openjpa-1.2.2.jar
Downloading: http://repo2.maven.org/maven2/net/sourceforge/serp/serp/1.11.0/serp-1.11.0.jar


[INFO] [enforcer:enforce {execution: default}]
[INFO] [remote-resources:process {execution: default}]
[INFO] [resources:resources {execution: default-resources}]
[INFO] Using 'UTF-8' encoding to copy filtered resources.
[INFO] skip non existing resourceDirectory /home/geronimo/geronimo/2.2/plugins/openjpa/geronimo-persistence-jpa10/src/main/resources
[INFO] skip non existing resourceDirectory /home/geronimo/geronimo/2.2/plugins/openjpa/geronimo-persistence-jpa10/src/main/filtered-resources
[INFO] Copying 3 resources
[INFO] [compiler:compile {execution: default-compile}]
[INFO] Nothing to compile - all classes are up to date
[INFO] [resources:testResources {execution: default-testResources}]
[INFO] Using 'UTF-8' encoding to copy filtered resources.
[INFO] skip non existing resourceDirectory /home/geronimo/geronimo/2.2/plugins/openjpa/geronimo-persistence-jpa10/src/test/resources
[INFO] skip non existing resourceDirectory /home/geronimo/geronimo/2.2/plugins/openjpa/geronimo-persistence-jpa10/src/test/filtered-resources
[INFO] Copying 3 resources
[INFO] [compiler:testCompile {execution: default-testCompile}]
[INFO] Nothing to compile - all classes are up to date
[INFO] [surefire:test {execution: default-test}]
[WARNING] Component returned which is not the same manager. Ignored. component=org.apache.maven.profiles.activation.AlwaysOnProfileActivator@14b814b8
[INFO] Surefire report directory: /home/geronimo/geronimo/2.2/plugins/openjpa/geronimo-persistence-jpa10/target/surefire-reports

-------------------------------------------------------
 T E S T S
-------------------------------------------------------
Running org.apache.geronimo.persistence.PersistenceUnitGBeanTest
Tests run: 2, Failures: 0, Errors: 1, Skipped: 0, Time elapsed: 0.18 sec <<< FAILURE!
Running org.apache.geronimo.persistence.CMPEntityManagerTest
Tests run: 9, Failures: 0, Errors: 0, Skipped: 0, Time elapsed: 0.132 sec

Results :

Tests in error: 
  testNonNullJavaFileUrls(org.apache.geronimo.persistence.PersistenceUnitGBeanTest)

Tests run: 11, Failures: 0, Errors: 1, Skipped: 0

[INFO] ------------------------------------------------------------------------
[ERROR] BUILD FAILURE
[INFO] ------------------------------------------------------------------------
[INFO] There are test failures.

Please refer to /home/geronimo/geronimo/2.2/plugins/openjpa/geronimo-persistence-jpa10/target/surefire-reports
for the individual test results.
[INFO] ------------------------------------------------------------------------
[INFO] Trace
org.apache.maven.BuildFailureException: There are test failures.

Please refer to /home/geronimo/geronimo/2.2/plugins/openjpa/geronimo-persistence-jpa10/target/surefire-reports
for the individual test results.
	at org.apache.maven.lifecycle.DefaultLifecycleExecutor.executeGoals(DefaultLifecycleExecutor.java:715)
	at org.apache.maven.lifecycle.DefaultLifecycleExecutor.executeGoalWithLifecycle(DefaultLifecycleExecutor.java:556)
	at org.apache.maven.lifecycle.DefaultLifecycleExecutor.executeGoal(DefaultLifecycleExecutor.java:535)
	at org.apache.maven.lifecycle.DefaultLifecycleExecutor.executeGoalAndHandleFailures(DefaultLifecycleExecutor.java:387)
	at org.apache.maven.lifecycle.DefaultLifecycleExecutor.executeTaskSegments(DefaultLifecycleExecutor.java:348)
	at org.apache.maven.lifecycle.DefaultLifecycleExecutor.execute(DefaultLifecycleExecutor.java:180)
	at org.apache.maven.DefaultMaven.doExecute(DefaultMaven.java:328)
	at org.apache.maven.DefaultMaven.execute(DefaultMaven.java:138)
	at org.apache.maven.cli.MavenCli.main(MavenCli.java:362)
	at org.apache.maven.cli.compat.CompatibleMain.main(CompatibleMain.java:60)
	at sun.reflect.NativeMethodAccessorImpl.invoke0(Native Method)
	at sun.reflect.NativeMethodAccessorImpl.invoke(NativeMethodAccessorImpl.java:79)
	at sun.reflect.DelegatingMethodAccessorImpl.invoke(DelegatingMethodAccessorImpl.java:43)
	at java.lang.reflect.Method.invoke(Method.java:618)
	at org.codehaus.classworlds.Launcher.launchEnhanced(Launcher.java:315)
	at org.codehaus.classworlds.Launcher.launch(Launcher.java:255)
	at org.codehaus.classworlds.Launcher.mainWithExitCode(Launcher.java:430)
	at org.codehaus.classworlds.Launcher.main(Launcher.java:375)
Caused by: org.apache.maven.plugin.MojoFailureException: There are test failures.

Please refer to /home/geronimo/geronimo/2.2/plugins/openjpa/geronimo-persistence-jpa10/target/surefire-reports
for the individual test results.
	at org.apache.maven.plugin.surefire.SurefirePlugin.execute(SurefirePlugin.java:575)
	at org.apache.maven.plugin.DefaultPluginManager.executeMojo(DefaultPluginManager.java:490)
	at org.apache.maven.lifecycle.DefaultLifecycleExecutor.executeGoals(DefaultLifecycleExecutor.java:694)
	... 17 more
[INFO] ------------------------------------------------------------------------
[INFO] Total time: 133 minutes 16 seconds
[INFO] Finished at: Sat Jun 04 04:16:26 EDT 2011
[INFO] Final Memory: 187M/569M
[INFO] ------------------------------------------------------------------------

Mime
View raw message