geronimo-dev mailing list archives

Site index · List index
Message view « Date » · « Thread »
Top « Date » · « Thread »
From ga...@apache.org (Jarek Gawor)
Subject [BUILD] branches/2.1: Failed for Revision: 1128993
Date Mon, 30 May 2011 15:10:29 GMT
Geronimo Revision: 1128993 built with tests included
 
See the full build-0200.log file at http://people.apache.org/builds/geronimo/server/binaries/2.1/20110530/build-0200.log
 
Download the binaries from http://people.apache.org/builds/geronimo/server/binaries/2.1/20110530
[INFO] BUILD SUCCESSFUL
[INFO] ------------------------------------------------------------------------
[INFO] Total time: 328 minutes 6 seconds
[INFO] Finished at: Mon May 30 07:32:09 EDT 2011
[INFO] Final Memory: 306M/826M
[INFO] ------------------------------------------------------------------------
 
TESTSUITE RESULTS (Failures only)
=================================
 
Assembly: tomcat
=================================
See full test results and logs at http://people.apache.org/builds/geronimo/server/binaries/2.1/20110530/logs-0200-tomcat/
 
 
[INFO] 
[INFO] Downloading: http://repo2.maven.org/maven2/org/codehaus/groovy/maven/runtime/gmaven-runtime-default/1.0-rc-3/gmaven-runtime-default-1.0-rc-3.pom
[INFO] 
[INFO] Downloading: http://repo2.maven.org/maven2/org/slf4j/slf4j-api/1.5.0/slf4j-api-1.5.0.pom
[INFO] 
[INFO] Downloading: http://repo2.maven.org/maven2/org/slf4j/slf4j-parent/1.5.0/slf4j-parent-1.5.0.pom
[INFO] 
[INFO] Downloading: http://repo2.maven.org/maven2/org/codehaus/groovy/maven/runtime/gmaven-runtime-1.5/1.0-rc-3/gmaven-runtime-1.5-1.0-rc-3.pom
[INFO] 
[INFO] Downloading: http://repo2.maven.org/maven2/org/codehaus/groovy/maven/feature/gmaven-feature-support/1.0-rc-3/gmaven-feature-support-1.0-rc-3.pom
[INFO] 
[INFO] Downloading: http://repo2.maven.org/maven2/org/codehaus/groovy/maven/runtime/gmaven-runtime-support/1.0-rc-3/gmaven-runtime-support-1.0-rc-3.pom
[INFO] 
[INFO] Downloading: http://repo2.maven.org/maven2/org/codehaus/groovy/maven/gmaven-common/1.0-rc-3/gmaven-common-1.0-rc-3.pom
[INFO] 
[INFO] Downloading: http://repo2.maven.org/maven2/org/codehaus/plexus/plexus-utils/1.5.5/plexus-utils-1.5.5.pom
[INFO] 
[INFO] Downloading: http://repo2.maven.org/maven2/org/codehaus/plexus/plexus/1.0.11/plexus-1.0.11.pom
[INFO] 
[INFO] Downloading: http://repo2.maven.org/maven2/com/thoughtworks/qdox/qdox/1.6.3/qdox-1.6.3.pom
[INFO] 
[INFO] Downloading: http://repo2.maven.org/maven2/org/codehaus/groovy/groovy-all-minimal/1.5.6/groovy-all-minimal-1.5.6.pom
[INFO] 
[INFO] Downloading: http://repo2.maven.org/maven2/org/apache/ant/ant/1.7.1/ant-1.7.1.pom
[INFO] 
[INFO] Downloading: http://repo2.maven.org/maven2/org/apache/ant/ant-parent/1.7.1/ant-parent-1.7.1.pom
[INFO] 
[INFO] Downloading: http://repo2.maven.org/maven2/org/apache/ant/ant-launcher/1.7.1/ant-launcher-1.7.1.pom
[INFO] 
[INFO] Downloading: http://repo2.maven.org/maven2/jline/jline/0.9.94/jline-0.9.94.pom
[INFO] 
[INFO] Downloading: http://repo2.maven.org/maven2/junit/junit/3.8.1/junit-3.8.1.pom
[INFO] 
[INFO] Downloading: http://repo2.maven.org/maven2/org/apache/maven/maven-project/2.0.5/maven-project-2.0.5.pom
[INFO] 
[INFO] Downloading: http://repo2.maven.org/maven2/org/apache/maven/maven/2.0.5/maven-2.0.5.pom
[INFO] 
[INFO] Downloading: http://repo2.maven.org/maven2/org/apache/maven/maven-settings/2.0.5/maven-settings-2.0.5.pom
[INFO] 
[INFO] Downloading: http://repo2.maven.org/maven2/org/apache/maven/maven-model/2.0.5/maven-model-2.0.5.pom
[INFO] 
[INFO] Downloading: http://repo2.maven.org/maven2/org/codehaus/plexus/plexus-utils/1.1/plexus-utils-1.1.pom
[INFO] 
[INFO] Downloading: http://repo2.maven.org/maven2/org/codehaus/plexus/plexus/1.0.4/plexus-1.0.4.pom
[INFO] 
[INFO] Downloading: http://repo2.maven.org/maven2/org/codehaus/plexus/plexus-container-default/1.0-alpha-9/plexus-container-default-1.0-alpha-9.pom
[INFO] 
[INFO] Downloading: http://repo2.maven.org/maven2/org/codehaus/plexus/plexus-containers/1.0.3/plexus-containers-1.0.3.pom
[INFO] 
[INFO] Downloading: http://repo2.maven.org/maven2/org/codehaus/plexus/plexus-utils/1.0.4/plexus-utils-1.0.4.pom
[INFO] 
[INFO] Downloading: http://repo2.maven.org/maven2/classworlds/classworlds/1.1-alpha-2/classworlds-1.1-alpha-2.pom
[INFO] 
[INFO] Downloading: http://repo2.maven.org/maven2/org/apache/maven/maven-profile/2.0.5/maven-profile-2.0.5.pom
[INFO] 
[INFO] Downloading: http://repo2.maven.org/maven2/org/apache/maven/maven-artifact-manager/2.0.5/maven-artifact-manager-2.0.5.pom
[INFO] 
[INFO] Downloading: http://repo2.maven.org/maven2/org/apache/maven/maven-repository-metadata/2.0.5/maven-repository-metadata-2.0.5.pom
[INFO] 
[INFO] Downloading: http://repo2.maven.org/maven2/org/apache/maven/maven-artifact/2.0.5/maven-artifact-2.0.5.pom
[INFO] 
[INFO] Downloading: http://repo2.maven.org/maven2/org/apache/maven/wagon/wagon-provider-api/1.0-beta-2/wagon-provider-api-1.0-beta-2.pom
[INFO] 
[INFO] Downloading: http://repo2.maven.org/maven2/org/apache/maven/wagon/wagon/1.0-beta-2/wagon-1.0-beta-2.pom
[INFO] 
[INFO] Downloading: http://repo2.maven.org/maven2/org/apache/maven/maven-parent/4/maven-parent-4.pom
[INFO] 
[INFO] Downloading: http://repo2.maven.org/maven2/org/apache/maven/maven-plugin-api/2.0.5/maven-plugin-api-2.0.5.pom
[INFO] 
[INFO] Downloading: http://repo2.maven.org/maven2/org/apache/ant/ant/1.7.1/ant-1.7.1.jar
[INFO] Downloading: http://repo2.maven.org/maven2/jline/jline/0.9.94/jline-0.9.94.jar
[INFO] Downloading: http://repo2.maven.org/maven2/org/slf4j/slf4j-api/1.5.0/slf4j-api-1.5.0.jar
[INFO] Downloading: http://repo2.maven.org/maven2/org/codehaus/groovy/groovy-all-minimal/1.5.6/groovy-all-minimal-1.5.6.jar
[INFO] Downloading: http://repo2.maven.org/maven2/org/codehaus/groovy/maven/feature/gmaven-feature-api/1.0-rc-3/gmaven-feature-api-1.0-rc-3.jar
[INFO] 
[INFO] Downloading: http://repo2.maven.org/maven2/org/codehaus/groovy/maven/gmaven-mojo/1.0-rc-3/gmaven-mojo-1.0-rc-3.jar
[INFO] 
[INFO] Downloading: http://repo2.maven.org/maven2/org/codehaus/groovy/maven/runtime/gmaven-runtime-api/1.0-rc-3/gmaven-runtime-api-1.0-rc-3.jar
[INFO] 
[INFO] Downloading: http://repo2.maven.org/maven2/com/thoughtworks/qdox/qdox/1.6.3/qdox-1.6.3.jar
[INFO] 
[INFO] Downloading: http://repo2.maven.org/maven2/org/codehaus/plexus/plexus-utils/1.1/plexus-utils-1.1.jar
[INFO] 
[INFO] Downloading: http://repo2.maven.org/maven2/org/codehaus/groovy/maven/feature/gmaven-feature-support/1.0-rc-3/gmaven-feature-support-1.0-rc-3.jar
[INFO] 
[INFO] Downloading: http://repo2.maven.org/maven2/org/codehaus/groovy/maven/gmaven-common/1.0-rc-3/gmaven-common-1.0-rc-3.jar
[INFO] 
[INFO] Downloading: http://repo2.maven.org/maven2/org/codehaus/groovy/maven/runtime/gmaven-runtime-default/1.0-rc-3/gmaven-runtime-default-1.0-rc-3.jar
[INFO] 
[INFO] 
[INFO] Downloading: http://repo2.maven.org/maven2/org/codehaus/groovy/maven/runtime/gmaven-runtime-1.5/1.0-rc-3/gmaven-runtime-1.5-1.0-rc-3.jar
[INFO] 
[INFO] Downloading: http://repo2.maven.org/maven2/org/codehaus/groovy/maven/runtime/gmaven-runtime-support/1.0-rc-3/gmaven-runtime-support-1.0-rc-3.jar
[INFO] 
[INFO] 
[INFO] 
[INFO] Downloading: http://repo2.maven.org/maven2/org/apache/ant/ant-launcher/1.7.1/ant-launcher-1.7.1.jar
[INFO] 
[INFO] 
[INFO] [INFO] ------------------------------------------------------------------------
[INFO] [ERROR] BUILD ERROR
[INFO] [INFO] ------------------------------------------------------------------------
[INFO] [INFO] Internal error in the plugin manager executing goal 'org.apache.geronimo.genesis:genesis-maven-plugin:2.0:validate-configuration':
Error adding plugin dependency 'org.codehaus.groovy.maven:gmaven-mojo:jar' into plugin manager:
Cannot add jar resource: /home/geronimo/.m2/repository/org/codehaus/groovy/maven/gmaven-mojo/1.0-rc-3/gmaven-mojo-1.0-rc-3.jar
(error discovering new components)
[INFO] error in opening zip file
[INFO] [INFO] ------------------------------------------------------------------------
[INFO] [INFO] Trace
[INFO] org.apache.maven.lifecycle.LifecycleExecutionException: Internal error in the plugin
manager executing goal 'org.apache.geronimo.genesis:genesis-maven-plugin:2.0:validate-configuration':
Error adding plugin dependency 'org.codehaus.groovy.maven:gmaven-mojo:jar' into plugin manager:
Cannot add jar resource: /home/geronimo/.m2/repository/org/codehaus/groovy/maven/gmaven-mojo/1.0-rc-3/gmaven-mojo-1.0-rc-3.jar
(error discovering new components)
[INFO] 	at org.apache.maven.lifecycle.DefaultLifecycleExecutor.executeGoals(DefaultLifecycleExecutor.java:698)
[INFO] 	at org.apache.maven.lifecycle.DefaultLifecycleExecutor.executeGoalWithLifecycle(DefaultLifecycleExecutor.java:556)
[INFO] 	at org.apache.maven.lifecycle.DefaultLifecycleExecutor.executeGoal(DefaultLifecycleExecutor.java:535)
[INFO] 	at org.apache.maven.lifecycle.DefaultLifecycleExecutor.executeGoalAndHandleFailures(DefaultLifecycleExecutor.java:387)
[INFO] 	at org.apache.maven.lifecycle.DefaultLifecycleExecutor.executeTaskSegments(DefaultLifecycleExecutor.java:348)
[INFO] 	at org.apache.maven.lifecycle.DefaultLifecycleExecutor.execute(DefaultLifecycleExecutor.java:180)
[INFO] 	at org.apache.maven.DefaultMaven.doExecute(DefaultMaven.java:328)
[INFO] 	at org.apache.maven.DefaultMaven.execute(DefaultMaven.java:138)
[INFO] 	at org.apache.maven.cli.MavenCli.main(MavenCli.java:362)
[INFO] 	at org.apache.maven.cli.compat.CompatibleMain.main(CompatibleMain.java:60)
[INFO] 	at sun.reflect.NativeMethodAccessorImpl.invoke0(Native Method)
[INFO] 	at sun.reflect.NativeMethodAccessorImpl.invoke(NativeMethodAccessorImpl.java:39)
[INFO] 	at sun.reflect.DelegatingMethodAccessorImpl.invoke(DelegatingMethodAccessorImpl.java:25)
[INFO] 	at java.lang.reflect.Method.invoke(Method.java:592)
[INFO] 	at org.codehaus.classworlds.Launcher.launchEnhanced(Launcher.java:315)
[INFO] 	at org.codehaus.classworlds.Launcher.launch(Launcher.java:255)
[INFO] 	at org.codehaus.classworlds.Launcher.mainWithExitCode(Launcher.java:430)
[INFO] 	at org.codehaus.classworlds.Launcher.main(Launcher.java:375)
[INFO] Caused by: org.apache.maven.plugin.PluginManagerException: Error adding plugin dependency
'org.codehaus.groovy.maven:gmaven-mojo:jar' into plugin manager: Cannot add jar resource:
/home/geronimo/.m2/repository/org/codehaus/groovy/maven/gmaven-mojo/1.0-rc-3/gmaven-mojo-1.0-rc-3.jar
(error discovering new components)
[INFO] 	at org.apache.maven.plugin.DefaultPluginManager.ensurePluginContainerIsComplete(DefaultPluginManager.java:857)
[INFO] 	at org.apache.maven.plugin.DefaultPluginManager.getConfiguredMojo(DefaultPluginManager.java:647)
[INFO] 	at org.apache.maven.plugin.DefaultPluginManager.executeMojo(DefaultPluginManager.java:468)
[INFO] 	at org.apache.maven.lifecycle.DefaultLifecycleExecutor.executeGoals(DefaultLifecycleExecutor.java:694)
[INFO] 	... 17 more
[INFO] Caused by: org.codehaus.plexus.PlexusContainerException: Cannot add jar resource: /home/geronimo/.m2/repository/org/codehaus/groovy/maven/gmaven-mojo/1.0-rc-3/gmaven-mojo-1.0-rc-3.jar
(error discovering new components)
[INFO] 	at org.codehaus.plexus.DefaultPlexusContainer.addJarResource(DefaultPlexusContainer.java:1405)
[INFO] 	at org.apache.maven.plugin.DefaultPluginManager.ensurePluginContainerIsComplete(DefaultPluginManager.java:853)
[INFO] 	... 20 more
[INFO] Caused by: org.codehaus.plexus.configuration.PlexusConfigurationException: Error reading
configuration jar:file:/home/geronimo/.m2/repository/org/apache/geronimo/genesis/genesis-maven-plugin/2.0/genesis-maven-plugin-2.0.jar!/META-INF/maven/plugin.xml
[INFO] 	at org.codehaus.plexus.component.discovery.AbstractComponentDiscoverer.findComponents(AbstractComponentDiscoverer.java:89)
[INFO] 	at org.codehaus.plexus.DefaultPlexusContainer.discoverComponents(DefaultPlexusContainer.java:717)
[INFO] 	at org.codehaus.plexus.DefaultPlexusContainer.addJarResource(DefaultPlexusContainer.java:1396)
[INFO] 	... 21 more
[INFO] Caused by: java.util.zip.ZipException: error in opening zip file
[INFO] 	at java.util.zip.ZipFile.open(Native Method)
[INFO] 	at java.util.zip.ZipFile.<init>(ZipFile.java:203)
[INFO] 	at java.util.jar.JarFile.<init>(JarFile.java:132)
[INFO] 	at java.util.jar.JarFile.<init>(JarFile.java:70)
[INFO] 	at sun.net.www.protocol.jar.URLJarFile.<init>(URLJarFile.java:56)
[INFO] 	at sun.net.www.protocol.jar.URLJarFile.getJarFile(URLJarFile.java:41)
[INFO] 	at sun.net.www.protocol.jar.JarFileFactory.get(JarFileFactory.java:68)
[INFO] 	at sun.net.www.protocol.jar.JarURLConnection.connect(JarURLConnection.java:102)
[INFO] 	at org.codehaus.plexus.component.discovery.AbstractComponentDiscoverer.findComponents(AbstractComponentDiscoverer.java:72)
[INFO] 	... 23 more
[INFO] [INFO] ------------------------------------------------------------------------
[INFO] [INFO] Total time: 15 minutes 47 seconds
[INFO] [INFO] Finished at: Mon May 30 08:10:47 EDT 2011
[INFO] [INFO] Final Memory: 16M/547M
[INFO] [INFO] ------------------------------------------------------------------------
[INFO] ------------------------------------------------------------------------
[ERROR] BUILD ERROR
 
Assembly: jetty
=================================
See full test results and logs at http://people.apache.org/builds/geronimo/server/binaries/2.1/20110530/logs-0200-jetty/
 
 
Waiting for Selenium Server...
[INFO] Including display properties from: /home/geronimo/geronimo/2.1/testsuite/commands-testsuite/target/selenium/display.properties
[INFO] Redirecting output to: /home/geronimo/geronimo/2.1/testsuite/commands-testsuite/target/selenium/server.log
[INFO] User extensions: /home/geronimo/geronimo/2.1/testsuite/commands-testsuite/target/selenium/user-extensions.js
Selenium Server started
[INFO] [geronimo:start-server {execution: start-server}]
[INFO] Using assembly configuration: jetty
[INFO] snapshot org.apache.geronimo.assemblies:geronimo-jetty6-javaee5:2.1.8-SNAPSHOT: checking
for updates from apache.snapshots
Downloading: http://repository.apache.org/snapshots/org/apache/geronimo/assemblies/geronimo-jetty6-javaee5/2.1.8-SNAPSHOT/geronimo-jetty6-javaee5-2.1.8-20101213.070420-1-bin.zip
78990K downloaded  (geronimo-jetty6-javaee5-2.1.8-20101213.070420-1-bin.zip)
[INFO] Using assembly artifact: org.apache.geronimo.assemblies:geronimo-jetty6-javaee5:zip:bin:2.1.8-SNAPSHOT:provided
[INFO] Using geronimoHome: /home/geronimo/geronimo/2.1/testsuite/commands-testsuite/target/geronimo-jetty6-javaee5-2.1.8-SNAPSHOT
[INFO] Installing assembly...
[INFO] Expanding: /home/geronimo/.m2/repository/org/apache/geronimo/assemblies/geronimo-jetty6-javaee5/2.1.8-SNAPSHOT/geronimo-jetty6-javaee5-2.1.8-SNAPSHOT-bin.zip
into /home/geronimo/geronimo/2.1/testsuite/commands-testsuite/target
[INFO] Starting Geronimo server...
[INFO] Selected option set: default
[INFO] Redirecting output to: /home/geronimo/geronimo/2.1/testsuite/commands-testsuite/target/geronimo-logs/org.apache.geronimo.mavenplugins.geronimo.server.StartServerMojo.log
[INFO] Waiting for Geronimo server...
[INFO] Geronimo server started in 0:00:43.722
[INFO] [:invoke {execution: default}]
[INFO] Invoking: /home/geronimo/geronimo/2.1/testsuite/commands-testsuite/deploy/pom.xml
[INFO] + Error stacktraces are turned on.
[INFO] [INFO] Scanning for projects...
[INFO] [INFO] ------------------------------------------------------------------------
[INFO] [INFO] Building Geronimo TestSuite :: Commands Testsuite :: Deployer
[INFO] [INFO]    task-segment: [install]
[INFO] [INFO] ------------------------------------------------------------------------
[INFO] [INFO] snapshot org.apache.geronimo.buildsupport:testsuite-maven-plugin:2.1.8-SNAPSHOT:
checking for updates from codehaus.snapshots
[INFO] [WARNING] repository metadata for: 'snapshot org.apache.geronimo.buildsupport:testsuite-maven-plugin:2.1.8-SNAPSHOT'
could not be retrieved from repository: codehaus.snapshots due to an error: Error transferring
file: Connection timed out
[INFO] [INFO] Repository 'codehaus.snapshots' will be blacklisted
[INFO] [INFO] snapshot org.apache.geronimo.buildsupport:testsuite-maven-plugin:2.1.8-SNAPSHOT:
checking for updates from codehaus.snapshots
[INFO] [WARNING] repository metadata for: 'snapshot org.apache.geronimo.buildsupport:testsuite-maven-plugin:2.1.8-SNAPSHOT'
could not be retrieved from repository: codehaus.snapshots due to an error: Error transferring
file: Connection timed out
[INFO] [INFO] Repository 'codehaus.snapshots' will be blacklisted
[INFO] [INFO] [genesis:validate-configuration {execution: default}]
[INFO] Downloading: http://repo2.maven.org/maven2/woodstox/wstx-asl/3.2.1/wstx-asl-3.2.1.pom
[INFO] [INFO] Unable to find resource 'woodstox:wstx-asl:pom:3.2.1' in repository central
(http://repo1.maven.org/maven2)
[INFO] [INFO] [enforcer:enforce {execution: default}]
[INFO] [INFO] Setting property: classpath.resource.loader.class => 'org.codehaus.plexus.velocity.ContextClassLoaderResourceLoader'.
[INFO] [INFO] Setting property: velocimacro.messages.on => 'false'.
[INFO] [INFO] Setting property: resource.loader => 'classpath'.
[INFO] [INFO] Setting property: resource.manager.logwhenfound => 'false'.
[INFO] [INFO] [remote-resources:process {execution: default}]
[INFO] [INFO] [resources:resources {execution: default-resources}]
[INFO] [INFO] Using 'UTF-8' encoding to copy filtered resources.
[INFO] [INFO] skip non existing resourceDirectory /home/geronimo/geronimo/2.1/testsuite/commands-testsuite/deploy/src/main/resources
[INFO] [INFO] Copying 3 resources
[INFO] [INFO] [compiler:compile {execution: default-compile}]
[INFO] [INFO] No sources to compile
[INFO] [INFO] [resources:testResources {execution: default-testResources}]
[INFO] [INFO] Using 'UTF-8' encoding to copy filtered resources.
[INFO] [INFO] Copying 1 resource
[INFO] [INFO] skip non existing resourceDirectory /home/geronimo/geronimo/2.1/testsuite/commands-testsuite/deploy/src/test/filtered-resources
[INFO] [INFO] Copying 3 resources
[INFO] [INFO] [compiler:testCompile {execution: default-testCompile}]
[INFO] [INFO] Compiling 2 source files to /home/geronimo/geronimo/2.1/testsuite/commands-testsuite/deploy/target/test-classes
[INFO] Downloading: http://repo2.maven.org/maven2/org/apache/maven/surefire/surefire-booter/2.3/surefire-booter-2.3.pom
[INFO] 
[INFO] Downloading: http://repo2.maven.org/maven2/org/apache/maven/surefire/surefire-booter/2.3/surefire-booter-2.3.jar
[INFO] 
[INFO] [INFO] [surefire:test {execution: default-test}]
[INFO] [INFO] Tests are skipped.
[INFO] [INFO] [surefire:test {execution: test}]
[INFO] [INFO] Tests are skipped.
[INFO] [INFO] [jar:jar {execution: default-jar}]
[INFO] [INFO] Building jar: /home/geronimo/geronimo/2.1/testsuite/commands-testsuite/deploy/target/deploy-2.1.8-SNAPSHOT.jar
[INFO] [INFO] [surefire:test {execution: integration}]
[INFO] Downloading: http://repo2.maven.org/maven2/org/codehaus/plexus/plexus-container-default/1.0-alpha-8/plexus-container-default-1.0-alpha-8.jar
[INFO] 
[INFO] Downloading: http://repo2.maven.org/maven2/org/apache/maven/surefire/surefire-testng/2.3/surefire-testng-2.3.pom
[INFO] 
[INFO] Downloading: http://repo2.maven.org/maven2/org/apache/maven/surefire/surefire-providers/2.3/surefire-providers-2.3.pom
[INFO] 
[INFO] Downloading: http://repo2.maven.org/maven2/org/apache/maven/surefire/surefire-testng/2.3/surefire-testng-2.3.jar
[INFO] 
[INFO] [INFO] Surefire report directory: /home/geronimo/geronimo/2.1/testsuite/commands-testsuite/deploy/target/surefire-reports
[INFO] 
[INFO] -------------------------------------------------------
[INFO]  T E S T S
[INFO] -------------------------------------------------------
[INFO] Running commands-testsuite.deploy
[INFO] Tests run: 8, Failures: 0, Errors: 0, Skipped: 0, Time elapsed: 61.18 sec
[INFO] 
[INFO] Results :
[INFO] 
[INFO] Tests run: 8, Failures: 0, Errors: 0, Skipped: 0
[INFO] 
[INFO] [INFO] [ianal:verify-legal-files {execution: default}]
[INFO] [WARNING] Skipping verification of legal files in artifacts:
[INFO] [WARNING]     org.apache.geronimo.testsuite:deploy:jar:2.1.8-SNAPSHOT
[INFO] [INFO] [install:install {execution: default-install}]
[INFO] [INFO] Installing /home/geronimo/geronimo/2.1/testsuite/commands-testsuite/deploy/target/deploy-2.1.8-SNAPSHOT.jar
to /home/geronimo/.m2/repository/org/apache/geronimo/testsuite/deploy/2.1.8-SNAPSHOT/deploy-2.1.8-SNAPSHOT.jar
[INFO] Downloading: http://repo2.maven.org/maven2/jtidy/jtidy/8.0-20060801/jtidy-8.0-20060801.pom
[INFO] [INFO] Unable to find resource 'jtidy:jtidy:pom:8.0-20060801' in repository central
(http://repo1.maven.org/maven2)
[INFO] Downloading: http://repo2.maven.org/maven2/jtidy/jtidy/8.0-20060801/jtidy-8.0-20060801.pom
[INFO] [INFO] Unable to find resource 'jtidy:jtidy:pom:8.0-20060801' in repository central
(http://repo1.maven.org/maven2)
[INFO] Downloading: http://repo2.maven.org/maven2/jtidy/jtidy/8.0-20060801/jtidy-8.0-20060801.jar
[INFO] [INFO] Unable to find resource 'jtidy:jtidy:jar:8.0-20060801' in repository central
(http://repo1.maven.org/maven2)
[INFO] Downloading: http://repo2.maven.org/maven2/jtidy/jtidy/8.0-20060801/jtidy-8.0-20060801.jar
[INFO] [INFO] Unable to find resource 'jtidy:jtidy:jar:8.0-20060801' in repository central
(http://repo1.maven.org/maven2)
[INFO] [INFO] ------------------------------------------------------------------------
[INFO] [ERROR] BUILD ERROR
--
[INFO] 
[INFO] for artifact: 
[INFO]   org.apache.geronimo.buildsupport:testsuite-maven-plugin:maven-plugin:2.1.8-20101213.070420-2
[INFO] 
[INFO] from the specified remote repositories:
[INFO]   codehaus.snapshots (http://snapshots.repository.codehaus.org),
[INFO]   ibiblio.org (http://repo2.maven.org/maven2),
[INFO]   apache.snapshots (http://repository.apache.org/snapshots)
[INFO] 
[INFO] 
[INFO] 
[INFO] [INFO] ------------------------------------------------------------------------
[INFO] [INFO] Trace
[INFO] org.apache.maven.lifecycle.LifecycleExecutionException: Missing:
[INFO] ----------
[INFO] 1) jtidy:jtidy:jar:8.0-20060801
[INFO] 
[INFO]   Try downloading the file manually from the project website.
[INFO] 
[INFO]   Then, install it using the command: 
[INFO]       mvn install:install-file -DgroupId=jtidy -DartifactId=jtidy -Dversion=8.0-20060801
-Dpackaging=jar -Dfile=/path/to/file
[INFO] 
[INFO]   Alternatively, if you host your own repository you can deploy the file there: 
[INFO]       mvn deploy:deploy-file -DgroupId=jtidy -DartifactId=jtidy -Dversion=8.0-20060801
-Dpackaging=jar -Dfile=/path/to/file -Durl=[url] -DrepositoryId=[id]
[INFO] 
[INFO]   Path to dependency: 
[INFO]   	1) org.apache.geronimo.buildsupport:testsuite-maven-plugin:maven-plugin:2.1.8-SNAPSHOT
[INFO]   	2) jtidy:jtidy:jar:8.0-20060801
[INFO] 
[INFO] ----------
[INFO] 1 required artifact is missing.
[INFO] 
[INFO] for artifact: 
[INFO]   org.apache.geronimo.buildsupport:testsuite-maven-plugin:maven-plugin:2.1.8-20101213.070420-2
[INFO] 
[INFO] from the specified remote repositories:
[INFO]   codehaus.snapshots (http://snapshots.repository.codehaus.org),
[INFO]   ibiblio.org (http://repo2.maven.org/maven2),
[INFO]   apache.snapshots (http://repository.apache.org/snapshots)
[INFO] 
[INFO] 
[INFO] 	at org.apache.maven.lifecycle.DefaultLifecycleExecutor.executeGoals(DefaultLifecycleExecutor.java:711)
[INFO] 	at org.apache.maven.lifecycle.DefaultLifecycleExecutor.executeGoalWithLifecycle(DefaultLifecycleExecutor.java:556)
[INFO] 	at org.apache.maven.lifecycle.DefaultLifecycleExecutor.executeGoal(DefaultLifecycleExecutor.java:535)
[INFO] 	at org.apache.maven.lifecycle.DefaultLifecycleExecutor.executeGoalAndHandleFailures(DefaultLifecycleExecutor.java:387)
[INFO] 	at org.apache.maven.lifecycle.DefaultLifecycleExecutor.executeTaskSegments(DefaultLifecycleExecutor.java:348)
[INFO] 	at org.apache.maven.lifecycle.DefaultLifecycleExecutor.execute(DefaultLifecycleExecutor.java:180)
[INFO] 	at org.apache.maven.DefaultMaven.doExecute(DefaultMaven.java:328)
[INFO] 	at org.apache.maven.DefaultMaven.execute(DefaultMaven.java:138)
[INFO] 	at org.apache.maven.cli.MavenCli.main(MavenCli.java:362)
[INFO] 	at org.apache.maven.cli.compat.CompatibleMain.main(CompatibleMain.java:60)
[INFO] 	at sun.reflect.NativeMethodAccessorImpl.invoke0(Native Method)
[INFO] 	at sun.reflect.NativeMethodAccessorImpl.invoke(NativeMethodAccessorImpl.java:39)
[INFO] 	at sun.reflect.DelegatingMethodAccessorImpl.invoke(DelegatingMethodAccessorImpl.java:25)
[INFO] 	at java.lang.reflect.Method.invoke(Method.java:592)
[INFO] 	at org.codehaus.classworlds.Launcher.launchEnhanced(Launcher.java:315)
[INFO] 	at org.codehaus.classworlds.Launcher.launch(Launcher.java:255)
[INFO] 	at org.codehaus.classworlds.Launcher.mainWithExitCode(Launcher.java:430)
[INFO] 	at org.codehaus.classworlds.Launcher.main(Launcher.java:375)
[INFO] Caused by: org.apache.maven.artifact.resolver.MultipleArtifactsNotFoundException: Missing:
[INFO] ----------
[INFO] 1) jtidy:jtidy:jar:8.0-20060801
[INFO] 
[INFO]   Try downloading the file manually from the project website.
[INFO] 
[INFO]   Then, install it using the command: 
[INFO]       mvn install:install-file -DgroupId=jtidy -DartifactId=jtidy -Dversion=8.0-20060801
-Dpackaging=jar -Dfile=/path/to/file
[INFO] 
[INFO]   Alternatively, if you host your own repository you can deploy the file there: 
[INFO]       mvn deploy:deploy-file -DgroupId=jtidy -DartifactId=jtidy -Dversion=8.0-20060801
-Dpackaging=jar -Dfile=/path/to/file -Durl=[url] -DrepositoryId=[id]
[INFO] 
[INFO]   Path to dependency: 
[INFO]   	1) org.apache.geronimo.buildsupport:testsuite-maven-plugin:maven-plugin:2.1.8-SNAPSHOT
[INFO]   	2) jtidy:jtidy:jar:8.0-20060801
[INFO] 
[INFO] ----------
[INFO] 1 required artifact is missing.
[INFO] 
[INFO] for artifact: 
[INFO]   org.apache.geronimo.buildsupport:testsuite-maven-plugin:maven-plugin:2.1.8-20101213.070420-2
[INFO] 
[INFO] from the specified remote repositories:
[INFO]   codehaus.snapshots (http://snapshots.repository.codehaus.org),
[INFO]   ibiblio.org (http://repo2.maven.org/maven2),
[INFO]   apache.snapshots (http://repository.apache.org/snapshots)
[INFO] 
[INFO] 
[INFO] 	at org.apache.maven.artifact.resolver.DefaultArtifactResolver.resolveTransitively(DefaultArtifactResolver.java:360)
[INFO] 	at org.apache.maven.artifact.resolver.DefaultArtifactResolver.resolveTransitively(DefaultArtifactResolver.java:304)
[INFO] 	at org.apache.maven.plugin.DefaultPluginManager.ensurePluginContainerIsComplete(DefaultPluginManager.java:835)
[INFO] 	at org.apache.maven.plugin.DefaultPluginManager.getConfiguredMojo(DefaultPluginManager.java:647)
[INFO] 	at org.apache.maven.plugin.DefaultPluginManager.executeMojo(DefaultPluginManager.java:468)
[INFO] 	at org.apache.maven.lifecycle.DefaultLifecycleExecutor.executeGoals(DefaultLifecycleExecutor.java:694)
[INFO] 	... 17 more
[INFO] [INFO] ------------------------------------------------------------------------
[INFO] [INFO] Total time: 8 minutes 14 seconds
[INFO] [INFO] Finished at: Mon May 30 11:36:56 EDT 2011
[INFO] [INFO] Final Memory: 40M/532M
[INFO] [INFO] ------------------------------------------------------------------------
[INFO] ------------------------------------------------------------------------
[ERROR] BUILD ERROR
 
Samples: branches/2.1
=================================
Log: http://people.apache.org/builds/geronimo/server/binaries/2.1/20110530/samples-0200.log
 
Build status: FAILED
 

Mime
View raw message