geronimo-dev mailing list archives

Site index · List index
Message view « Date » · « Thread »
Top « Date » · « Thread »
From ga...@apache.org (Jarek Gawor)
Subject [BUILD] branches/2.1: Failed for Revision: 1127785
Date Thu, 26 May 2011 06:18:26 GMT
Geronimo Revision: 1127785 built with tests included
 
See the full build-0200.log file at http://people.apache.org/builds/geronimo/server/binaries/2.1/20110526/build-0200.log
 
 
See the unit test reports at http://people.apache.org/builds/geronimo/server/binaries/2.1/20110526/unit-test-reports
 
Tests run: 5, Failures: 0, Errors: 0, Skipped: 0, Time elapsed: 0.014 sec
Running org.apache.geronimo.system.configuration.LocalAttributeManagerTest
Tests run: 10, Failures: 0, Errors: 0, Skipped: 0, Time elapsed: 0.66 sec

Results :

Tests run: 63, Failures: 0, Errors: 0, Skipped: 0

[INFO] [jar:jar {execution: default-jar}]
[INFO] Building jar: /home/geronimo/geronimo/2.1/framework/modules/geronimo-system/target/geronimo-system-2.1.8-SNAPSHOT.jar
[INFO] [ianal:verify-legal-files {execution: default}]
[INFO] Checking legal files in: geronimo-system-2.1.8-SNAPSHOT.jar
[INFO] [install:install {execution: default-install}]
[INFO] Installing /home/geronimo/geronimo/2.1/framework/modules/geronimo-system/target/geronimo-system-2.1.8-SNAPSHOT.jar
to /home/geronimo/.m2/repository/org/apache/geronimo/framework/geronimo-system/2.1.8-SNAPSHOT/geronimo-system-2.1.8-SNAPSHOT.jar
[INFO] ------------------------------------------------------------------------
[INFO] Building Geronimo Framework, Modules :: Plugin
[INFO]    task-segment: [install]
[INFO] ------------------------------------------------------------------------
[INFO] [genesis:validate-configuration {execution: default}]
[INFO] [enforcer:enforce {execution: default}]
[INFO] [remote-resources:process {execution: default}]
[INFO] [resources:resources {execution: default-resources}]
[INFO] Using 'UTF-8' encoding to copy filtered resources.
[INFO] skip non existing resourceDirectory /home/geronimo/geronimo/2.1/framework/modules/geronimo-plugin/src/main/resources
[INFO] skip non existing resourceDirectory /home/geronimo/geronimo/2.1/framework/modules/geronimo-plugin/src/main/filtered-resources
[INFO] Copying 3 resources
[INFO] [compiler:compile {execution: default-compile}]
[INFO] Compiling 21 source files to /home/geronimo/geronimo/2.1/framework/modules/geronimo-plugin/target/classes
[INFO] [resources:testResources {execution: default-testResources}]
[INFO] Using 'UTF-8' encoding to copy filtered resources.
[INFO] Copying 6 resources
[INFO] skip non existing resourceDirectory /home/geronimo/geronimo/2.1/framework/modules/geronimo-plugin/src/test/filtered-resources
[INFO] Copying 3 resources
[INFO] [compiler:testCompile {execution: default-testCompile}]
[INFO] Compiling 4 source files to /home/geronimo/geronimo/2.1/framework/modules/geronimo-plugin/target/test-classes
[INFO] [surefire:test {execution: default-test}]
[INFO] Surefire report directory: /home/geronimo/geronimo/2.1/framework/modules/geronimo-plugin/target/surefire-reports
[INFO] ------------------------------------------------------------------------
[ERROR] BUILD ERROR
[INFO] ------------------------------------------------------------------------
[INFO] Error while executing forked tests.; nested exception is org.apache.maven.surefire.booter.shade.org.codehaus.plexus.util.cli.CommandLineException:
Error setting up environmental variables

java.io.IOException: Cannot allocate memory
[INFO] ------------------------------------------------------------------------
[INFO] Trace
org.apache.maven.lifecycle.LifecycleExecutionException: Error while executing forked tests.;
nested exception is org.apache.maven.surefire.booter.shade.org.codehaus.plexus.util.cli.CommandLineException:
Error setting up environmental variables
	at org.apache.maven.lifecycle.DefaultLifecycleExecutor.executeGoals(DefaultLifecycleExecutor.java:719)
	at org.apache.maven.lifecycle.DefaultLifecycleExecutor.executeGoalWithLifecycle(DefaultLifecycleExecutor.java:556)
	at org.apache.maven.lifecycle.DefaultLifecycleExecutor.executeGoal(DefaultLifecycleExecutor.java:535)
	at org.apache.maven.lifecycle.DefaultLifecycleExecutor.executeGoalAndHandleFailures(DefaultLifecycleExecutor.java:387)
	at org.apache.maven.lifecycle.DefaultLifecycleExecutor.executeTaskSegments(DefaultLifecycleExecutor.java:348)
	at org.apache.maven.lifecycle.DefaultLifecycleExecutor.execute(DefaultLifecycleExecutor.java:180)
	at org.apache.maven.DefaultMaven.doExecute(DefaultMaven.java:328)
	at org.apache.maven.DefaultMaven.execute(DefaultMaven.java:138)
	at org.apache.maven.cli.MavenCli.main(MavenCli.java:362)
	at org.apache.maven.cli.compat.CompatibleMain.main(CompatibleMain.java:60)
	at sun.reflect.NativeMethodAccessorImpl.invoke0(Native Method)
	at sun.reflect.NativeMethodAccessorImpl.invoke(NativeMethodAccessorImpl.java:39)
	at sun.reflect.DelegatingMethodAccessorImpl.invoke(DelegatingMethodAccessorImpl.java:25)
	at java.lang.reflect.Method.invoke(Method.java:592)
	at org.codehaus.classworlds.Launcher.launchEnhanced(Launcher.java:315)
	at org.codehaus.classworlds.Launcher.launch(Launcher.java:255)
	at org.codehaus.classworlds.Launcher.mainWithExitCode(Launcher.java:430)
	at org.codehaus.classworlds.Launcher.main(Launcher.java:375)
Caused by: org.apache.maven.plugin.MojoExecutionException: Error while executing forked tests.;
nested exception is org.apache.maven.surefire.booter.shade.org.codehaus.plexus.util.cli.CommandLineException:
Error setting up environmental variables
	at org.apache.maven.plugin.surefire.SurefirePlugin.execute(SurefirePlugin.java:541)
	at org.apache.maven.plugin.DefaultPluginManager.executeMojo(DefaultPluginManager.java:490)
	at org.apache.maven.lifecycle.DefaultLifecycleExecutor.executeGoals(DefaultLifecycleExecutor.java:694)
	... 17 more
Caused by: org.apache.maven.surefire.booter.SurefireBooterForkException: Error while executing
forked tests.; nested exception is org.apache.maven.surefire.booter.shade.org.codehaus.plexus.util.cli.CommandLineException:
Error setting up environmental variables
	at org.apache.maven.surefire.booter.SurefireBooter.fork(SurefireBooter.java:677)
	at org.apache.maven.surefire.booter.SurefireBooter.forkSuites(SurefireBooter.java:479)
	at org.apache.maven.surefire.booter.SurefireBooter.runSuitesForkOnce(SurefireBooter.java:379)
	at org.apache.maven.surefire.booter.SurefireBooter.run(SurefireBooter.java:245)
	at org.apache.maven.plugin.surefire.SurefirePlugin.execute(SurefirePlugin.java:537)
	... 19 more
Caused by: org.apache.maven.surefire.booter.shade.org.codehaus.plexus.util.cli.CommandLineException:
Error setting up environmental variables
	at org.apache.maven.surefire.booter.shade.org.codehaus.plexus.util.cli.Commandline.getEnvironmentVariables(Commandline.java:464)
	at org.apache.maven.surefire.booter.shade.org.codehaus.plexus.util.cli.Commandline.execute(Commandline.java:626)
	at org.apache.maven.surefire.booter.shade.org.codehaus.plexus.util.cli.CommandLineUtils.executeCommandLine(CommandLineUtils.java:117)
	at org.apache.maven.surefire.booter.shade.org.codehaus.plexus.util.cli.CommandLineUtils.executeCommandLine(CommandLineUtils.java:98)
	at org.apache.maven.surefire.booter.SurefireBooter.fork(SurefireBooter.java:673)
	... 23 more
Caused by: java.io.IOException: java.io.IOException: Cannot allocate memory
	at java.lang.UNIXProcess.<init>(UNIXProcess.java:148)
	at java.lang.ProcessImpl.start(ProcessImpl.java:65)
	at java.lang.ProcessBuilder.start(ProcessBuilder.java:451)
	at java.lang.Runtime.exec(Runtime.java:591)
	at java.lang.Runtime.exec(Runtime.java:429)
	at java.lang.Runtime.exec(Runtime.java:326)
	at org.apache.maven.surefire.booter.shade.org.codehaus.plexus.util.cli.CommandLineUtils.getSystemEnvVars(CommandLineUtils.java:250)
	at org.apache.maven.surefire.booter.shade.org.codehaus.plexus.util.cli.CommandLineUtils.getSystemEnvVars(CommandLineUtils.java:216)
	at org.apache.maven.surefire.booter.shade.org.codehaus.plexus.util.cli.Commandline.addSystemEnvironment(Commandline.java:440)
	at org.apache.maven.surefire.booter.shade.org.codehaus.plexus.util.cli.Commandline.getEnvironmentVariables(Commandline.java:460)
	... 27 more
[INFO] ------------------------------------------------------------------------
[INFO] Total time: 54 minutes 12 seconds
[INFO] Finished at: Thu May 26 02:58:21 EDT 2011
[INFO] Final Memory: 152M/522M
[INFO] ------------------------------------------------------------------------

Mime
View raw message