geronimo-dev mailing list archives

Site index · List index
Message view « Date » · « Thread »
Top « Date » · « Thread »
From ga...@apache.org (Jarek Gawor)
Subject [BUILD] branches/2.1: Failed for Revision: 1101751
Date Wed, 11 May 2011 12:07:28 GMT
Geronimo Revision: 1101751 built with tests included
 
See the full build-0200.log file at http://people.apache.org/builds/geronimo/server/binaries/2.1/20110511/build-0200.log
 
Download the binaries from http://people.apache.org/builds/geronimo/server/binaries/2.1/20110511
[INFO] BUILD SUCCESSFUL
[INFO] ------------------------------------------------------------------------
[INFO] Total time: 44 minutes 12 seconds
[INFO] Finished at: Wed May 11 06:42:13 EDT 2011
[INFO] Final Memory: 301M/906M
[INFO] ------------------------------------------------------------------------
 
TESTSUITE RESULTS (Failures only)
=================================
 
Assembly: tomcat
=================================
See full test results and logs at http://people.apache.org/builds/geronimo/server/binaries/2.1/20110511/logs-0200-tomcat/
 
[INFO] Running security-testsuite.security
[INFO] Tests run: 36, Failures: 1, Errors: 0, Skipped: 0, Time elapsed: 61.068 sec <<<
FAILURE!
 
Assembly: jetty
=================================
See full test results and logs at http://people.apache.org/builds/geronimo/server/binaries/2.1/20110511/logs-0200-jetty/
 
 
[INFO] [INFO] [surefire:test {execution: integration}]
[INFO] [INFO] Surefire report directory: /home/geronimo/geronimo/2.1/testsuite/web-testsuite/test-2.5-servlets/target/surefire-reports
[INFO] 
[INFO] -------------------------------------------------------
[INFO]  T E S T S
[INFO] -------------------------------------------------------
[INFO] Running web-testsuite.servlets
[INFO] Tests run: 2, Failures: 0, Errors: 0, Skipped: 0, Time elapsed: 0.659 sec
[INFO] 
[INFO] Results :
[INFO] 
[INFO] Tests run: 2, Failures: 0, Errors: 0, Skipped: 0
[INFO] 
[INFO] [INFO] [geronimo:undeploy-module {execution: undeploy-war-as-moduleId}]
[INFO] [INFO] Using non-artifact based module id: org.apache.geronimo.testsuite/test-2.5-servlets/2.1.8-SNAPSHOT/car
[INFO] [INFO] Stopping module: org.apache.geronimo.testsuite/test-2.5-servlets/2.1.8-SNAPSHOT/car
[INFO] [INFO] Stopped module(s):
[INFO] [INFO]     [0] org.apache.geronimo.testsuite/test-2.5-servlets/2.1.8-SNAPSHOT/car;
URL: /servlet25
[INFO] [INFO] Undeploying module: org.apache.geronimo.testsuite/test-2.5-servlets/2.1.8-SNAPSHOT/car
[INFO] [INFO] Undeployed module(s):
[INFO] [INFO]     [0] org.apache.geronimo.testsuite/test-2.5-servlets/2.1.8-SNAPSHOT/car
[INFO] [INFO] [ianal:verify-legal-files {execution: default}]
[INFO] [WARNING] Skipping verification of legal files in artifacts:
[INFO] [WARNING]     org.apache.geronimo.testsuite:test-2.5-servlets:war:2.1.8-SNAPSHOT
[INFO] [INFO] [install:install {execution: default-install}]
[INFO] [INFO] Installing /home/geronimo/geronimo/2.1/testsuite/web-testsuite/test-2.5-servlets/target/test-2.5-servlets-2.1.8-SNAPSHOT.war
to /home/geronimo/.m2/repository/org/apache/geronimo/testsuite/test-2.5-servlets/2.1.8-SNAPSHOT/test-2.5-servlets-2.1.8-SNAPSHOT.war
[INFO] [INFO] [testsuite:generate-surefire-xml {execution: generate-surefire-xml}]
[INFO] [INFO] Updating directory: /home/geronimo/geronimo/2.1/testsuite/web-testsuite/target/surefire-reports
[INFO] [INFO] Loading surefire xml for xmlproperty: /home/geronimo/geronimo/2.1/testsuite/web-testsuite/test-2.5-servlets/target/surefire-reports/TEST-org.apache.geronimo.mavenplugins.geronimo.module.DeployModuleMojo.xml
[INFO] [INFO] Loading surefire xml for xmlproperty: /home/geronimo/geronimo/2.1/testsuite/web-testsuite/test-2.5-servlets/target/surefire-reports/TEST-org.apache.geronimo.mavenplugins.geronimo.module.UndeployModuleMojo.xml
[INFO] [INFO] Loading parent surefire xml for xmlproperty: /home/geronimo/geronimo/2.1/testsuite/web-testsuite/target/surefire-reports/TEST-test-2.5-servlets.xml
[INFO] [INFO] Loading surefire xml for xmlproperty: /home/geronimo/geronimo/2.1/testsuite/web-testsuite/test-2.5-servlets/target/surefire-reports/TEST-web-testsuite.servlets.xml
[INFO] [INFO] Loading parent surefire xml for xmlproperty: /home/geronimo/geronimo/2.1/testsuite/web-testsuite/target/surefire-reports/TEST-test-2.5-servlets.xml
[INFO] [INFO] ------------------------------------------------------------------------
[INFO] [INFO] BUILD SUCCESSFUL
[INFO] [INFO] ------------------------------------------------------------------------
[INFO] [INFO] Total time: 30 seconds
[INFO] [INFO] Finished at: Wed May 11 07:59:57 EDT 2011
[INFO] [INFO] Final Memory: 44M/547M
[INFO] [INFO] ------------------------------------------------------------------------
[INFO] Invoking: /home/geronimo/geronimo/2.1/testsuite/web-testsuite/test-jetty/pom.xml
[INFO] + Error stacktraces are turned on.
[INFO] [INFO] Scanning for projects...
[INFO] [INFO] ------------------------------------------------------------------------
[INFO] [INFO] Building Geronimo TestSuite :: Web Testsuite :: Test Jetty
[INFO] [INFO]    task-segment: [install]
[INFO] [INFO] ------------------------------------------------------------------------
[INFO] [INFO] [genesis:validate-configuration {execution: default}]
[INFO] [INFO] [enforcer:enforce {execution: default}]
[INFO] [INFO] Setting property: classpath.resource.loader.class => 'org.codehaus.plexus.velocity.ContextClassLoaderResourceLoader'.
[INFO] [INFO] Setting property: velocimacro.messages.on => 'false'.
[INFO] [INFO] Setting property: resource.loader => 'classpath'.
[INFO] [INFO] Setting property: resource.manager.logwhenfound => 'false'.
[INFO] [INFO] [remote-resources:process {execution: default}]
[INFO] [INFO] [resources:resources {execution: default-resources}]
[INFO] [INFO] Using 'UTF-8' encoding to copy filtered resources.
[INFO] [INFO] skip non existing resourceDirectory /home/geronimo/geronimo/2.1/testsuite/web-testsuite/test-jetty/src/main/resources
[INFO] [INFO] Copying 3 resources
[INFO] [INFO] [compiler:compile {execution: default-compile}]
[INFO] [INFO] No sources to compile
[INFO] [INFO] [resources:testResources {execution: default-testResources}]
[INFO] [INFO] Using 'UTF-8' encoding to copy filtered resources.
[INFO] [INFO] Copying 1 resource
[INFO] [INFO] skip non existing resourceDirectory /home/geronimo/geronimo/2.1/testsuite/web-testsuite/test-jetty/src/test/filtered-resources
[INFO] [INFO] Copying 3 resources
[INFO] [INFO] [compiler:testCompile {execution: default-testCompile}]
[INFO] [INFO] Compiling 1 source file to /home/geronimo/geronimo/2.1/testsuite/web-testsuite/test-jetty/target/test-classes
[INFO] [INFO] [surefire:test {execution: default-test}]
[INFO] [INFO] Tests are skipped.
[INFO] [INFO] [surefire:test {execution: test}]
[INFO] [INFO] Tests are skipped.
[INFO] [INFO] [war:war {execution: default-war}]
[INFO] [INFO] Exploding webapp...
[INFO] [INFO] Assembling webapp test-jetty in /home/geronimo/geronimo/2.1/testsuite/web-testsuite/test-jetty/target/test-jetty-2.1.8-SNAPSHOT
[INFO] [INFO] Copy webapp webResources to /home/geronimo/geronimo/2.1/testsuite/web-testsuite/test-jetty/target/test-jetty-2.1.8-SNAPSHOT
[INFO] [INFO] Copy webapp webResources to /home/geronimo/geronimo/2.1/testsuite/web-testsuite/test-jetty/target/test-jetty-2.1.8-SNAPSHOT
[INFO] [INFO] Copy webapp webResources to /home/geronimo/geronimo/2.1/testsuite/web-testsuite/test-jetty/target/test-jetty-2.1.8-SNAPSHOT
[INFO] [INFO] Building jar: /home/geronimo/geronimo/2.1/testsuite/web-testsuite/test-jetty/target/test-jetty-2.1.8-SNAPSHOT/WEB-INF/lib/test-jetty-2.1.8-SNAPSHOT.jar
[INFO] [INFO] Generating war /home/geronimo/geronimo/2.1/testsuite/web-testsuite/test-jetty/target/test-jetty-2.1.8-SNAPSHOT.war
[INFO] [INFO] Building war: /home/geronimo/geronimo/2.1/testsuite/web-testsuite/test-jetty/target/test-jetty-2.1.8-SNAPSHOT.war
[INFO] Downloading: http://repo2.maven.org/maven2/javax/xml/bind/jaxb-api/2.0/jaxb-api-2.0.pom
[INFO] 
[INFO] Downloading: http://repo2.maven.org/maven2/javax/activation/activation/1.1/activation-1.1.pom
[INFO] 
[INFO] Downloading: http://repo2.maven.org/maven2/woodstox/wstx-asl/3.2.1/wstx-asl-3.2.1.pom
[INFO] [INFO] Unable to find resource 'woodstox:wstx-asl:pom:3.2.1' in repository central
(http://repo1.maven.org/maven2)
[INFO] Downloading: http://repo2.maven.org/maven2/org/codehaus/plexus/plexus-utils/1.4.5/plexus-utils-1.4.5.pom
[INFO] 
[INFO] Downloading: http://repo2.maven.org/maven2/org/codehaus/plexus/plexus-container-default/1.0-alpha-32/plexus-container-default-1.0-alpha-32.pom
[INFO] 
[INFO] Downloading: http://repo2.maven.org/maven2/org/codehaus/plexus/plexus-containers/1.0-alpha-32/plexus-containers-1.0-alpha-32.pom
[INFO] 
[INFO] Downloading: http://repo2.maven.org/maven2/org/codehaus/plexus/plexus-component-api/1.0-alpha-32/plexus-component-api-1.0-alpha-32.pom
[INFO] 
[INFO] Downloading: http://repo2.maven.org/maven2/org/codehaus/plexus/plexus-classworlds/1.2-alpha-10/plexus-classworlds-1.2-alpha-10.pom
[INFO] 
[INFO] Downloading: http://repo2.maven.org/maven2/org/codehaus/plexus/plexus/1.0.10/plexus-1.0.10.pom
[INFO] 
[INFO] [INFO] Unable to find resource 'org.codehaus.plexus:plexus:pom:1.0.10' in repository
central (http://repo1.maven.org/maven2)
[INFO] [INFO] ------------------------------------------------------------------------
[INFO] [ERROR] BUILD ERROR
--
[INFO] 	at org.apache.maven.lifecycle.DefaultLifecycleExecutor.executeGoalAndHandleFailures(DefaultLifecycleExecutor.java:387)
[INFO] 	at org.apache.maven.lifecycle.DefaultLifecycleExecutor.executeTaskSegments(DefaultLifecycleExecutor.java:348)
[INFO] 	at org.apache.maven.lifecycle.DefaultLifecycleExecutor.execute(DefaultLifecycleExecutor.java:180)
[INFO] 	at org.apache.maven.DefaultMaven.doExecute(DefaultMaven.java:328)
[INFO] 	at org.apache.maven.DefaultMaven.execute(DefaultMaven.java:138)
[INFO] 	at org.apache.maven.cli.MavenCli.main(MavenCli.java:362)
[INFO] 	at org.apache.maven.cli.compat.CompatibleMain.main(CompatibleMain.java:60)
[INFO] 	at sun.reflect.NativeMethodAccessorImpl.invoke0(Native Method)
[INFO] 	at sun.reflect.NativeMethodAccessorImpl.invoke(NativeMethodAccessorImpl.java:39)
[INFO] 	at sun.reflect.DelegatingMethodAccessorImpl.invoke(DelegatingMethodAccessorImpl.java:25)
[INFO] 	at java.lang.reflect.Method.invoke(Method.java:592)
[INFO] 	at org.codehaus.classworlds.Launcher.launchEnhanced(Launcher.java:315)
[INFO] 	at org.codehaus.classworlds.Launcher.launch(Launcher.java:255)
[INFO] 	at org.codehaus.classworlds.Launcher.mainWithExitCode(Launcher.java:430)
[INFO] 	at org.codehaus.classworlds.Launcher.main(Launcher.java:375)
[INFO] Caused by: org.apache.maven.artifact.resolver.ArtifactResolutionException: Unable to
get dependency information: Unable to read the metadata file for artifact 'org.codehaus.plexus:plexus-classworlds:jar':
Cannot find parent: org.codehaus.plexus:plexus for project: org.codehaus.plexus:plexus-classworlds:jar:1.2-alpha-10
for project org.codehaus.plexus:plexus-classworlds:jar:1.2-alpha-10
[INFO]   org.codehaus.plexus:plexus-classworlds:jar:1.2-alpha-10
[INFO] 
[INFO] from the specified remote repositories:
[INFO]   central (http://repo1.maven.org/maven2),
[INFO]   apache-snapshots (http://people.apache.org/maven-snapshot-repository),
[INFO]   codehaus-snapshots (http://snapshots.repository.codehaus.org),
[INFO]   codehaus.snapshots (http://snapshots.repository.codehaus.org),
[INFO]   apache.snapshots (http://repository.apache.org/snapshots)
[INFO] 
[INFO] Path to dependency: 
[INFO] 	1) org.apache.geronimo.buildsupport:geronimo-maven-plugin:maven-plugin:2.1.8-SNAPSHOT
[INFO] 	2) org.apache.geronimo.framework:geronimo-deploy-jsr88:jar:2.1.8-SNAPSHOT
[INFO] 	3) org.apache.geronimo.framework:geronimo-plugin:jar:2.1.8-SNAPSHOT
[INFO] 	4) org.codehaus.plexus:plexus-archiver:jar:1.0-alpha-7
[INFO] 	5) org.codehaus.plexus:plexus-container-default:jar:1.0-alpha-32
[INFO] 	6) org.codehaus.plexus:plexus-component-api:jar:1.0-alpha-32
[INFO] 
[INFO] 
[INFO] 	at org.apache.maven.artifact.resolver.DefaultArtifactCollector.recurse(DefaultArtifactCollector.java:430)
[INFO] 	at org.apache.maven.artifact.resolver.DefaultArtifactCollector.recurse(DefaultArtifactCollector.java:435)
[INFO] 	at org.apache.maven.artifact.resolver.DefaultArtifactCollector.recurse(DefaultArtifactCollector.java:435)
[INFO] 	at org.apache.maven.artifact.resolver.DefaultArtifactCollector.recurse(DefaultArtifactCollector.java:435)
[INFO] 	at org.apache.maven.artifact.resolver.DefaultArtifactCollector.recurse(DefaultArtifactCollector.java:435)
[INFO] 	at org.apache.maven.artifact.resolver.DefaultArtifactCollector.recurse(DefaultArtifactCollector.java:435)
[INFO] 	at org.apache.maven.artifact.resolver.DefaultArtifactCollector.collect(DefaultArtifactCollector.java:74)
[INFO] 	at org.apache.maven.artifact.resolver.DefaultArtifactResolver.resolveTransitively(DefaultArtifactResolver.java:316)
[INFO] 	at org.apache.maven.artifact.resolver.DefaultArtifactResolver.resolveTransitively(DefaultArtifactResolver.java:304)
[INFO] 	at org.apache.maven.plugin.DefaultPluginManager.ensurePluginContainerIsComplete(DefaultPluginManager.java:835)
[INFO] 	at org.apache.maven.plugin.DefaultPluginManager.getConfiguredMojo(DefaultPluginManager.java:647)
[INFO] 	at org.apache.maven.plugin.DefaultPluginManager.executeMojo(DefaultPluginManager.java:468)
[INFO] 	at org.apache.maven.lifecycle.DefaultLifecycleExecutor.executeGoals(DefaultLifecycleExecutor.java:694)
[INFO] 	... 17 more
[INFO] Caused by: org.apache.maven.artifact.metadata.ArtifactMetadataRetrievalException: Unable
to read the metadata file for artifact 'org.codehaus.plexus:plexus-classworlds:jar': Cannot
find parent: org.codehaus.plexus:plexus for project: org.codehaus.plexus:plexus-classworlds:jar:1.2-alpha-10
for project org.codehaus.plexus:plexus-classworlds:jar:1.2-alpha-10
[INFO] 	at org.apache.maven.project.artifact.MavenMetadataSource.retrieveRelocatedProject(MavenMetadataSource.java:200)
[INFO] 	at org.apache.maven.project.artifact.MavenMetadataSource.retrieveRelocatedArtifact(MavenMetadataSource.java:94)
[INFO] 	at org.apache.maven.artifact.resolver.DefaultArtifactCollector.recurse(DefaultArtifactCollector.java:387)
[INFO] 	... 29 more
[INFO] Caused by: org.apache.maven.project.ProjectBuildingException: Cannot find parent: org.codehaus.plexus:plexus
for project: org.codehaus.plexus:plexus-classworlds:jar:1.2-alpha-10 for project org.codehaus.plexus:plexus-classworlds:jar:1.2-alpha-10
[INFO] 	at org.apache.maven.project.DefaultMavenProjectBuilder.assembleLineage(DefaultMavenProjectBuilder.java:1396)
[INFO] 	at org.apache.maven.project.DefaultMavenProjectBuilder.buildInternal(DefaultMavenProjectBuilder.java:823)
[INFO] 	at org.apache.maven.project.DefaultMavenProjectBuilder.buildFromRepository(DefaultMavenProjectBuilder.java:255)
[INFO] 	at org.apache.maven.project.artifact.MavenMetadataSource.retrieveRelocatedProject(MavenMetadataSource.java:163)
[INFO] 	... 31 more
[INFO] Caused by: org.apache.maven.project.ProjectBuildingException: POM 'org.codehaus.plexus:plexus'
not found in repository: Unable to download the artifact from any repository
[INFO] 
[INFO]   org.codehaus.plexus:plexus:pom:1.0.10
[INFO] 
[INFO] from the specified remote repositories:
[INFO]   apache-snapshots (http://people.apache.org/maven-snapshot-repository),
[INFO]   codehaus-snapshots (http://snapshots.repository.codehaus.org),
[INFO]   codehaus.snapshots (http://snapshots.repository.codehaus.org),
[INFO]   ibiblio.org (http://repo2.maven.org/maven2),
[INFO]   apache.snapshots (http://repository.apache.org/snapshots)
[INFO] 
[INFO]  for project org.codehaus.plexus:plexus
[INFO] 	at org.apache.maven.project.DefaultMavenProjectBuilder.findModelFromRepository(DefaultMavenProjectBuilder.java:605)
[INFO] 	at org.apache.maven.project.DefaultMavenProjectBuilder.assembleLineage(DefaultMavenProjectBuilder.java:1392)
[INFO] 	... 34 more
[INFO] Caused by: org.apache.maven.artifact.resolver.ArtifactNotFoundException: Unable to
download the artifact from any repository
[INFO] 
[INFO]   org.codehaus.plexus:plexus:pom:1.0.10
[INFO] 
[INFO] from the specified remote repositories:
[INFO]   apache-snapshots (http://people.apache.org/maven-snapshot-repository),
[INFO]   codehaus-snapshots (http://snapshots.repository.codehaus.org),
[INFO]   codehaus.snapshots (http://snapshots.repository.codehaus.org),
[INFO]   ibiblio.org (http://repo2.maven.org/maven2),
[INFO]   apache.snapshots (http://repository.apache.org/snapshots)
[INFO] 
[INFO] 
[INFO] 	at org.apache.maven.artifact.resolver.DefaultArtifactResolver.resolve(DefaultArtifactResolver.java:228)
[INFO] 	at org.apache.maven.artifact.resolver.DefaultArtifactResolver.resolve(DefaultArtifactResolver.java:90)
[INFO] 	at org.apache.maven.project.DefaultMavenProjectBuilder.findModelFromRepository(DefaultMavenProjectBuilder.java:558)
[INFO] 	... 35 more
[INFO] Caused by: org.apache.maven.wagon.ResourceDoesNotExistException: Unable to download
the artifact from any repository
[INFO] 	at org.apache.maven.artifact.manager.DefaultWagonManager.getArtifact(DefaultWagonManager.java:404)
[INFO] 	at org.apache.maven.artifact.resolver.DefaultArtifactResolver.resolve(DefaultArtifactResolver.java:216)
[INFO] 	... 37 more
[INFO] [INFO] ------------------------------------------------------------------------
[INFO] [INFO] Total time: 15 seconds
[INFO] [INFO] Finished at: Wed May 11 08:00:14 EDT 2011
[INFO] [INFO] Final Memory: 37M/552M
[INFO] [INFO] ------------------------------------------------------------------------
[INFO] ------------------------------------------------------------------------
[ERROR] BUILD ERROR
 
Samples: branches/2.1
=================================
Log: http://people.apache.org/builds/geronimo/server/binaries/2.1/20110511/samples-0200.log
 
Build status: FAILED
 

Mime
View raw message