geronimo-dev mailing list archives

Site index · List index
Message view « Date » · « Thread »
Top « Date » · « Thread »
From ga...@apache.org (Jarek Gawor)
Subject [BUILD] branches/2.1: Failed for Revision: 1100889
Date Mon, 09 May 2011 11:50:05 GMT
Geronimo Revision: 1100889 built with tests included
 
See the full build-0200.log file at http://people.apache.org/builds/geronimo/server/binaries/2.1/20110509/build-0200.log
 
Download the binaries from http://people.apache.org/builds/geronimo/server/binaries/2.1/20110509
[INFO] BUILD SUCCESSFUL
[INFO] ------------------------------------------------------------------------
[INFO] Total time: 263 minutes 12 seconds
[INFO] Finished at: Mon May 09 06:46:34 EDT 2011
[INFO] Final Memory: 312M/823M
[INFO] ------------------------------------------------------------------------
 
TESTSUITE RESULTS (Failures only)
=================================
 
Assembly: tomcat
=================================
See full test results and logs at http://people.apache.org/builds/geronimo/server/binaries/2.1/20110509/logs-0200-tomcat/
 
[INFO] Running security-testsuite.security
[INFO] Tests run: 36, Failures: 1, Errors: 0, Skipped: 0, Time elapsed: 60.019 sec <<<
FAILURE!
 
Assembly: jetty
=================================
See full test results and logs at http://people.apache.org/builds/geronimo/server/binaries/2.1/20110509/logs-0200-jetty/
 
 
[INFO] -------------------------------------------------------
[INFO] There are no tests to run.
[INFO] 
[INFO] Results :
[INFO] 
[INFO] Tests run: 0, Failures: 0, Errors: 0, Skipped: 0
[INFO] 
[INFO] [INFO] [ianal:verify-legal-files {execution: default}]
[INFO] [WARNING] Skipping verification of legal files in artifacts:
[INFO] [WARNING]     org.apache.geronimo.testsuite:sec-ejb:ejb:2.1.8-SNAPSHOT
[INFO] [INFO] [install:install {execution: default-install}]
[INFO] [INFO] Installing /home/geronimo/geronimo/2.1/testsuite/enterprise-testsuite/sec-tests/sec-ejb/target/sec-ejb-2.1.8-SNAPSHOT.jar
to /home/geronimo/.m2/repository/org/apache/geronimo/testsuite/sec-ejb/2.1.8-SNAPSHOT/sec-ejb-2.1.8-SNAPSHOT.jar
[INFO] [INFO] [testsuite:generate-surefire-xml {execution: generate-surefire-xml}]
[INFO] [INFO] Updating directory: /home/geronimo/geronimo/2.1/testsuite/enterprise-testsuite/sec-tests/target/surefire-reports
[INFO] [INFO] No surefire-reports directory here
[INFO] [INFO] ------------------------------------------------------------------------
[INFO] [INFO] Building Geronimo TestSuite :: Enterprise Testsuite :: Security - WAR
[INFO] [INFO]    task-segment: [install]
[INFO] [INFO] ------------------------------------------------------------------------
[INFO] [INFO] [genesis:validate-configuration {execution: default}]
[INFO] [INFO] [enforcer:enforce {execution: default}]
[INFO] [INFO] [remote-resources:process {execution: default}]
[INFO] [INFO] [resources:resources {execution: default-resources}]
[INFO] [INFO] Using 'UTF-8' encoding to copy filtered resources.
[INFO] [INFO] skip non existing resourceDirectory /home/geronimo/geronimo/2.1/testsuite/enterprise-testsuite/sec-tests/sec-war/src/main/resources
[INFO] [INFO] Copying 3 resources
[INFO] [INFO] [compiler:compile {execution: default-compile}]
[INFO] [INFO] Compiling 1 source file to /home/geronimo/geronimo/2.1/testsuite/enterprise-testsuite/sec-tests/sec-war/target/classes
[INFO] [INFO] [resources:testResources {execution: default-testResources}]
[INFO] [INFO] Using 'UTF-8' encoding to copy filtered resources.
[INFO] [INFO] skip non existing resourceDirectory /home/geronimo/geronimo/2.1/testsuite/enterprise-testsuite/sec-tests/sec-war/src/test/resources
[INFO] [INFO] skip non existing resourceDirectory /home/geronimo/geronimo/2.1/testsuite/enterprise-testsuite/sec-tests/sec-war/src/test/filtered-resources
[INFO] [INFO] Copying 3 resources
[INFO] [INFO] [compiler:testCompile {execution: default-testCompile}]
[INFO] [INFO] No sources to compile
[INFO] [INFO] [surefire:test {execution: default-test}]
[INFO] [INFO] Tests are skipped.
[INFO] [INFO] [surefire:test {execution: test}]
[INFO] [INFO] Tests are skipped.
[INFO] [INFO] [war:war {execution: default-war}]
[INFO] [INFO] Exploding webapp...
[INFO] [INFO] Assembling webapp sec-war in /home/geronimo/geronimo/2.1/testsuite/enterprise-testsuite/sec-tests/sec-war/target/sec-war-2.1.8-SNAPSHOT
[INFO] [INFO] Copy webapp webResources to /home/geronimo/geronimo/2.1/testsuite/enterprise-testsuite/sec-tests/sec-war/target/sec-war-2.1.8-SNAPSHOT
[INFO] [INFO] Copy webapp webResources to /home/geronimo/geronimo/2.1/testsuite/enterprise-testsuite/sec-tests/sec-war/target/sec-war-2.1.8-SNAPSHOT
[INFO] [INFO] Copy webapp webResources to /home/geronimo/geronimo/2.1/testsuite/enterprise-testsuite/sec-tests/sec-war/target/sec-war-2.1.8-SNAPSHOT
[INFO] [INFO] Building jar: /home/geronimo/geronimo/2.1/testsuite/enterprise-testsuite/sec-tests/sec-war/target/sec-war-2.1.8-SNAPSHOT/WEB-INF/lib/sec-war-2.1.8-SNAPSHOT.jar
[INFO] [INFO] Generating war /home/geronimo/geronimo/2.1/testsuite/enterprise-testsuite/sec-tests/sec-war/target/sec-war-2.1.8-SNAPSHOT.war
[INFO] [INFO] Building war: /home/geronimo/geronimo/2.1/testsuite/enterprise-testsuite/sec-tests/sec-war/target/sec-war-2.1.8-SNAPSHOT.war
[INFO] [INFO] [surefire:test {execution: integration}]
[INFO] [INFO] Surefire report directory: /home/geronimo/geronimo/2.1/testsuite/enterprise-testsuite/sec-tests/sec-war/target/surefire-reports
[INFO] 
[INFO] -------------------------------------------------------
[INFO]  T E S T S
[INFO] -------------------------------------------------------
[INFO] There are no tests to run.
[INFO] 
[INFO] Results :
[INFO] 
[INFO] Tests run: 0, Failures: 0, Errors: 0, Skipped: 0
[INFO] 
[INFO] [INFO] [ianal:verify-legal-files {execution: default}]
[INFO] [WARNING] Skipping verification of legal files in artifacts:
[INFO] [WARNING]     org.apache.geronimo.testsuite:sec-war:war:2.1.8-SNAPSHOT
[INFO] [INFO] [install:install {execution: default-install}]
[INFO] [INFO] Installing /home/geronimo/geronimo/2.1/testsuite/enterprise-testsuite/sec-tests/sec-war/target/sec-war-2.1.8-SNAPSHOT.war
to /home/geronimo/.m2/repository/org/apache/geronimo/testsuite/sec-war/2.1.8-SNAPSHOT/sec-war-2.1.8-SNAPSHOT.war
[INFO] [INFO] [testsuite:generate-surefire-xml {execution: generate-surefire-xml}]
[INFO] [INFO] Updating directory: /home/geronimo/geronimo/2.1/testsuite/enterprise-testsuite/sec-tests/target/surefire-reports
[INFO] [INFO] No surefire-reports directory here
[INFO] [INFO] ------------------------------------------------------------------------
[INFO] [INFO] Building Geronimo TestSuite :: Enterprise Testsuite :: Security - EAR
[INFO] [INFO]    task-segment: [install]
[INFO] [INFO] ------------------------------------------------------------------------
[INFO] [INFO] [genesis:validate-configuration {execution: default}]
[INFO] [INFO] [enforcer:enforce {execution: default}]
[INFO] [INFO] [ear:generate-application-xml {execution: default-generate-application-xml}]
[INFO] [INFO] Generating application.xml
[INFO] [INFO] [remote-resources:process {execution: default}]
[INFO] [INFO] [resources:resources {execution: default-resources}]
[INFO] [INFO] Using 'UTF-8' encoding to copy filtered resources.
[INFO] [INFO] Copying 1 resource
[INFO] [INFO] Copying 3 resources
[INFO] [INFO] [resources:testResources {execution: default}]
[INFO] [INFO] Using 'UTF-8' encoding to copy filtered resources.
[INFO] [INFO] Copying 1 resource
[INFO] [INFO] skip non existing resourceDirectory /home/geronimo/geronimo/2.1/testsuite/enterprise-testsuite/sec-tests/sec-ear/src/test/filtered-resources
[INFO] [INFO] Copying 3 resources
[INFO] [INFO] [compiler:testCompile {execution: default}]
[INFO] [INFO] Compiling 1 source file to /home/geronimo/geronimo/2.1/testsuite/enterprise-testsuite/sec-tests/sec-ear/target/test-classes
[INFO] [INFO] [surefire:test {execution: test}]
[INFO] [INFO] Tests are skipped.
[INFO] [INFO] [ear:ear {execution: default-ear}]
[INFO] [INFO] Copying artifact[war:org.apache.geronimo.testsuite:sec-war:2.1.8-SNAPSHOT] to[web.war]
[INFO] [INFO] Copying artifact[ejb:org.apache.geronimo.testsuite:sec-ejb:2.1.8-SNAPSHOT] to[ejb.jar]
[INFO] [INFO] Copy ear resources to /home/geronimo/geronimo/2.1/testsuite/enterprise-testsuite/sec-tests/sec-ear/target/sec-ear-2.1.8-SNAPSHOT
[INFO] [INFO] Could not find manifest file: /home/geronimo/geronimo/2.1/testsuite/enterprise-testsuite/sec-tests/sec-ear/src/main/application/META-INF/MANIFEST.MF
- Generating one
[INFO] [INFO] Building jar: /home/geronimo/geronimo/2.1/testsuite/enterprise-testsuite/sec-tests/sec-ear/target/sec-ear-2.1.8-SNAPSHOT.ear
[INFO] Downloading: http://repo2.maven.org/maven2/jline/jline/0.9.94/jline-0.9.94.jar
[INFO] 
[INFO] [INFO] Unable to find resource 'jline:jline:jar:0.9.94' in repository central (http://repo1.maven.org/maven2)
[INFO] [INFO] ------------------------------------------------------------------------
[INFO] [ERROR] BUILD ERROR
--
[INFO]   codehaus.org.override (https://nexus.codehaus.org/content/repositories/releases/),
[INFO]   apache.snapshots (http://repository.apache.org/snapshots)
[INFO] 
[INFO] 
[INFO] 
[INFO] [INFO] ------------------------------------------------------------------------
[INFO] [INFO] Trace
[INFO] org.apache.maven.lifecycle.LifecycleExecutionException: Missing:
[INFO] ----------
[INFO] 1) jline:jline:jar:0.9.94
[INFO] 
[INFO]   Try downloading the file manually from the project website.
[INFO] 
[INFO]   Then, install it using the command: 
[INFO]       mvn install:install-file -DgroupId=jline -DartifactId=jline -Dversion=0.9.94
-Dpackaging=jar -Dfile=/path/to/file
[INFO] 
[INFO]   Alternatively, if you host your own repository you can deploy the file there: 
[INFO]       mvn deploy:deploy-file -DgroupId=jline -DartifactId=jline -Dversion=0.9.94 -Dpackaging=jar
-Dfile=/path/to/file -Durl=[url] -DrepositoryId=[id]
[INFO] 
[INFO]   Path to dependency: 
[INFO]   	1) org.codehaus.mojo:selenium-maven-plugin:maven-plugin:1.0.1
[INFO]   	2) org.codehaus.groovy.maven:gmaven-mojo:jar:1.0-rc-4
[INFO]   	3) org.codehaus.groovy.maven.runtime:gmaven-runtime-1.5:jar:1.0-rc-4
[INFO]   	4) jline:jline:jar:0.9.94
[INFO] 
[INFO] ----------
[INFO] 1 required artifact is missing.
[INFO] 
[INFO] for artifact: 
[INFO]   org.codehaus.mojo:selenium-maven-plugin:maven-plugin:1.0.1
[INFO] 
[INFO] from the specified remote repositories:
[INFO]   codehaus.snapshots (http://snapshots.repository.codehaus.org),
[INFO]   ibiblio.org (http://repo2.maven.org/maven2),
[INFO]   codehaus.org.override (https://nexus.codehaus.org/content/repositories/releases/),
[INFO]   apache.snapshots (http://repository.apache.org/snapshots)
[INFO] 
[INFO] 
[INFO] 	at org.apache.maven.lifecycle.DefaultLifecycleExecutor.executeGoals(DefaultLifecycleExecutor.java:711)
[INFO] 	at org.apache.maven.lifecycle.DefaultLifecycleExecutor.executeGoalWithLifecycle(DefaultLifecycleExecutor.java:556)
[INFO] 	at org.apache.maven.lifecycle.DefaultLifecycleExecutor.executeGoal(DefaultLifecycleExecutor.java:535)
[INFO] 	at org.apache.maven.lifecycle.DefaultLifecycleExecutor.executeGoalAndHandleFailures(DefaultLifecycleExecutor.java:387)
[INFO] 	at org.apache.maven.lifecycle.DefaultLifecycleExecutor.executeTaskSegments(DefaultLifecycleExecutor.java:348)
[INFO] 	at org.apache.maven.lifecycle.DefaultLifecycleExecutor.execute(DefaultLifecycleExecutor.java:180)
[INFO] 	at org.apache.maven.DefaultMaven.doExecute(DefaultMaven.java:328)
[INFO] 	at org.apache.maven.DefaultMaven.execute(DefaultMaven.java:138)
[INFO] 	at org.apache.maven.cli.MavenCli.main(MavenCli.java:362)
[INFO] 	at org.apache.maven.cli.compat.CompatibleMain.main(CompatibleMain.java:60)
[INFO] 	at sun.reflect.NativeMethodAccessorImpl.invoke0(Native Method)
[INFO] 	at sun.reflect.NativeMethodAccessorImpl.invoke(NativeMethodAccessorImpl.java:39)
[INFO] 	at sun.reflect.DelegatingMethodAccessorImpl.invoke(DelegatingMethodAccessorImpl.java:25)
[INFO] 	at java.lang.reflect.Method.invoke(Method.java:592)
[INFO] 	at org.codehaus.classworlds.Launcher.launchEnhanced(Launcher.java:315)
[INFO] 	at org.codehaus.classworlds.Launcher.launch(Launcher.java:255)
[INFO] 	at org.codehaus.classworlds.Launcher.mainWithExitCode(Launcher.java:430)
[INFO] 	at org.codehaus.classworlds.Launcher.main(Launcher.java:375)
[INFO] Caused by: org.apache.maven.artifact.resolver.MultipleArtifactsNotFoundException: Missing:
[INFO] ----------
[INFO] 1) jline:jline:jar:0.9.94
[INFO] 
[INFO]   Try downloading the file manually from the project website.
[INFO] 
[INFO]   Then, install it using the command: 
[INFO]       mvn install:install-file -DgroupId=jline -DartifactId=jline -Dversion=0.9.94
-Dpackaging=jar -Dfile=/path/to/file
[INFO] 
[INFO]   Alternatively, if you host your own repository you can deploy the file there: 
[INFO]       mvn deploy:deploy-file -DgroupId=jline -DartifactId=jline -Dversion=0.9.94 -Dpackaging=jar
-Dfile=/path/to/file -Durl=[url] -DrepositoryId=[id]
[INFO] 
[INFO]   Path to dependency: 
[INFO]   	1) org.codehaus.mojo:selenium-maven-plugin:maven-plugin:1.0.1
[INFO]   	2) org.codehaus.groovy.maven:gmaven-mojo:jar:1.0-rc-4
[INFO]   	3) org.codehaus.groovy.maven.runtime:gmaven-runtime-1.5:jar:1.0-rc-4
[INFO]   	4) jline:jline:jar:0.9.94
[INFO] 
[INFO] ----------
[INFO] 1 required artifact is missing.
[INFO] 
[INFO] for artifact: 
[INFO]   org.codehaus.mojo:selenium-maven-plugin:maven-plugin:1.0.1
[INFO] 
[INFO] from the specified remote repositories:
[INFO]   codehaus.snapshots (http://snapshots.repository.codehaus.org),
[INFO]   ibiblio.org (http://repo2.maven.org/maven2),
[INFO]   codehaus.org.override (https://nexus.codehaus.org/content/repositories/releases/),
[INFO]   apache.snapshots (http://repository.apache.org/snapshots)
[INFO] 
[INFO] 
[INFO] 	at org.apache.maven.artifact.resolver.DefaultArtifactResolver.resolveTransitively(DefaultArtifactResolver.java:360)
[INFO] 	at org.apache.maven.artifact.resolver.DefaultArtifactResolver.resolveTransitively(DefaultArtifactResolver.java:304)
[INFO] 	at org.apache.maven.plugin.DefaultPluginManager.ensurePluginContainerIsComplete(DefaultPluginManager.java:835)
[INFO] 	at org.apache.maven.plugin.DefaultPluginManager.getConfiguredMojo(DefaultPluginManager.java:647)
[INFO] 	at org.apache.maven.plugin.DefaultPluginManager.executeMojo(DefaultPluginManager.java:468)
[INFO] 	at org.apache.maven.lifecycle.DefaultLifecycleExecutor.executeGoals(DefaultLifecycleExecutor.java:694)
[INFO] 	... 17 more
[INFO] [INFO] ------------------------------------------------------------------------
[INFO] [INFO] Total time: 35 seconds
[INFO] [INFO] Finished at: Mon May 09 08:00:24 EDT 2011
[INFO] [INFO] Final Memory: 49M/549M
[INFO] [INFO] ------------------------------------------------------------------------
[INFO] ------------------------------------------------------------------------
[ERROR] BUILD ERROR
 
Samples: branches/2.1
=================================
Log: http://people.apache.org/builds/geronimo/server/binaries/2.1/20110509/samples-0200.log
 
Build status: FAILED
 

Mime
View raw message