geronimo-dev mailing list archives

Site index · List index
Message view « Date » · « Thread »
Top « Date » · « Thread »
From ga...@apache.org (Jarek Gawor)
Subject [BUILD] branches/2.1: Failed for Revision: 1099685
Date Thu, 05 May 2011 18:36:06 GMT
Geronimo Revision: 1099685 built with tests included
 
See the full build-0200.log file at http://people.apache.org/builds/geronimo/server/binaries/2.1/20110505/build-0200.log
 
Download the binaries from http://people.apache.org/builds/geronimo/server/binaries/2.1/20110505
[INFO] BUILD SUCCESSFUL
[INFO] ------------------------------------------------------------------------
[INFO] Total time: 204 minutes 34 seconds
[INFO] Finished at: Thu May 05 12:36:51 EDT 2011
[INFO] Final Memory: 314M/828M
[INFO] ------------------------------------------------------------------------
 
TESTSUITE RESULTS (Failures only)
=================================
 
Assembly: tomcat
=================================
See full test results and logs at http://people.apache.org/builds/geronimo/server/binaries/2.1/20110505/logs-0200-tomcat/
 
[INFO] Running security-testsuite.security
[INFO] Tests run: 36, Failures: 1, Errors: 0, Skipped: 0, Time elapsed: 61.464 sec <<<
FAILURE!
 
Assembly: jetty
=================================
See full test results and logs at http://people.apache.org/builds/geronimo/server/binaries/2.1/20110505/logs-0200-jetty/
 
 
[INFO] [INFO] Unable to find resource 'javax.mail:mail:jar:1.4' in repository jibx (http://jibx.sourceforge.net/maven)
[INFO] Downloading: http://download.java.net/maven/1//javax.mail/jars/mail-1.4.jar
[INFO] 379K downloaded  (mail-1.4.jar)
[INFO] Downloading: http://ws.zones.apache.org/repository2/javax/xml/bind/jaxb-api/2.0/jaxb-api-2.0.jar
[INFO] [INFO] Unable to find resource 'javax.xml.bind:jaxb-api:jar:2.0' in repository apache-ws-snapshots2
(http://ws.zones.apache.org/repository2)
[INFO] Downloading: http://tomcat.apache.org/dev/dist/m2-repository/javax/xml/bind/jaxb-api/2.0/jaxb-api-2.0.jar
[INFO] [INFO] Unable to find resource 'javax.xml.bind:jaxb-api:jar:2.0' in repository tomcat-repository
(http://tomcat.apache.org/dev/dist/m2-repository)
[INFO] Downloading: http://people.apache.org/repo/m2-incubating-repository/javax/xml/bind/jaxb-api/2.0/jaxb-api-2.0.jar
[INFO] [INFO] Unable to find resource 'javax.xml.bind:jaxb-api:jar:2.0' in repository apache-incubating
(http://people.apache.org/repo/m2-incubating-repository)
[INFO] Downloading: http://repo1.maven.org/eclipse/javax/xml/bind/jaxb-api/2.0/jaxb-api-2.0.jar
[INFO] [INFO] Unable to find resource 'javax.xml.bind:jaxb-api:jar:2.0' in repository eclipse-repo
(http://repo1.maven.org/eclipse)
[INFO] Downloading: http://jibx.sourceforge.net/maven/javax.xml.bind/jars/jaxb-api-2.0.jar
[INFO] [INFO] Unable to find resource 'javax.xml.bind:jaxb-api:jar:2.0' in repository jibx
(http://jibx.sourceforge.net/maven)
[INFO] Downloading: http://download.java.net/maven/1//javax.xml.bind/jars/jaxb-api-2.0.jar
[INFO] 84K downloaded  (jaxb-api-2.0.jar)
[INFO] Downloading: http://ws.zones.apache.org/repository2/org/apache/geronimo/specs/geronimo-activation_1.1_spec/1.0.2/geronimo-activation_1.1_spec-1.0.2.jar
[INFO] [INFO] Unable to find resource 'org.apache.geronimo.specs:geronimo-activation_1.1_spec:jar:1.0.2'
in repository apache-ws-snapshots2 (http://ws.zones.apache.org/repository2)
[INFO] Downloading: http://tomcat.apache.org/dev/dist/m2-repository/org/apache/geronimo/specs/geronimo-activation_1.1_spec/1.0.2/geronimo-activation_1.1_spec-1.0.2.jar
[INFO] [INFO] Unable to find resource 'org.apache.geronimo.specs:geronimo-activation_1.1_spec:jar:1.0.2'
in repository tomcat-repository (http://tomcat.apache.org/dev/dist/m2-repository)
[INFO] Downloading: http://people.apache.org/repo/m2-incubating-repository/org/apache/geronimo/specs/geronimo-activation_1.1_spec/1.0.2/geronimo-activation_1.1_spec-1.0.2.jar
[INFO] [INFO] Unable to find resource 'org.apache.geronimo.specs:geronimo-activation_1.1_spec:jar:1.0.2'
in repository apache-incubating (http://people.apache.org/repo/m2-incubating-repository)
[INFO] Downloading: http://repo1.maven.org/eclipse/org/apache/geronimo/specs/geronimo-activation_1.1_spec/1.0.2/geronimo-activation_1.1_spec-1.0.2.jar
[INFO] [INFO] Unable to find resource 'org.apache.geronimo.specs:geronimo-activation_1.1_spec:jar:1.0.2'
in repository eclipse-repo (http://repo1.maven.org/eclipse)
[INFO] Downloading: http://jibx.sourceforge.net/maven/org.apache.geronimo.specs/jars/geronimo-activation_1.1_spec-1.0.2.jar
[INFO] [INFO] Unable to find resource 'org.apache.geronimo.specs:geronimo-activation_1.1_spec:jar:1.0.2'
in repository jibx (http://jibx.sourceforge.net/maven)
[INFO] Downloading: http://download.java.net/maven/1//org.apache.geronimo.specs/jars/geronimo-activation_1.1_spec-1.0.2.jar
[INFO] [INFO] Unable to find resource 'org.apache.geronimo.specs:geronimo-activation_1.1_spec:jar:1.0.2'
in repository java.net (http://download.java.net/maven/1/)
[INFO] Downloading: http://repo2.maven.org/maven2/org/apache/geronimo/specs/geronimo-activation_1.1_spec/1.0.2/geronimo-activation_1.1_spec-1.0.2.jar
[INFO] 
[INFO] Downloading: http://ws.zones.apache.org/repository2/org/apache/axis2/axis2-saaj-api/1.3/axis2-saaj-api-1.3.jar
[INFO] [INFO] Unable to find resource 'org.apache.axis2:axis2-saaj-api:jar:1.3' in repository
apache-ws-snapshots2 (http://ws.zones.apache.org/repository2)
[INFO] Downloading: http://tomcat.apache.org/dev/dist/m2-repository/org/apache/axis2/axis2-saaj-api/1.3/axis2-saaj-api-1.3.jar
[INFO] [INFO] Unable to find resource 'org.apache.axis2:axis2-saaj-api:jar:1.3' in repository
tomcat-repository (http://tomcat.apache.org/dev/dist/m2-repository)
[INFO] Downloading: http://people.apache.org/repo/m2-incubating-repository/org/apache/axis2/axis2-saaj-api/1.3/axis2-saaj-api-1.3.jar
[INFO] [INFO] Unable to find resource 'org.apache.axis2:axis2-saaj-api:jar:1.3' in repository
apache-incubating (http://people.apache.org/repo/m2-incubating-repository)
[INFO] Downloading: http://repo1.maven.org/eclipse/org/apache/axis2/axis2-saaj-api/1.3/axis2-saaj-api-1.3.jar
[INFO] [INFO] Unable to find resource 'org.apache.axis2:axis2-saaj-api:jar:1.3' in repository
eclipse-repo (http://repo1.maven.org/eclipse)
[INFO] Downloading: http://jibx.sourceforge.net/maven/org.apache.axis2/jars/axis2-saaj-api-1.3.jar
[INFO] [INFO] Unable to find resource 'org.apache.axis2:axis2-saaj-api:jar:1.3' in repository
jibx (http://jibx.sourceforge.net/maven)
[INFO] Downloading: http://download.java.net/maven/1//org.apache.axis2/jars/axis2-saaj-api-1.3.jar
[INFO] [INFO] Unable to find resource 'org.apache.axis2:axis2-saaj-api:jar:1.3' in repository
java.net (http://download.java.net/maven/1/)
[INFO] Downloading: http://repo2.maven.org/maven2/org/apache/axis2/axis2-saaj-api/1.3/axis2-saaj-api-1.3.jar
[INFO] 
[INFO] Downloading: http://ws.zones.apache.org/repository2/org/apache/ws/commons/axiom/axiom-impl/1.2.5/axiom-impl-1.2.5.jar
[INFO] [INFO] Unable to find resource 'org.apache.ws.commons.axiom:axiom-impl:jar:1.2.5' in
repository apache-ws-snapshots2 (http://ws.zones.apache.org/repository2)
[INFO] Downloading: http://tomcat.apache.org/dev/dist/m2-repository/org/apache/ws/commons/axiom/axiom-impl/1.2.5/axiom-impl-1.2.5.jar
[INFO] [INFO] Unable to find resource 'org.apache.ws.commons.axiom:axiom-impl:jar:1.2.5' in
repository tomcat-repository (http://tomcat.apache.org/dev/dist/m2-repository)
[INFO] Downloading: http://people.apache.org/repo/m2-incubating-repository/org/apache/ws/commons/axiom/axiom-impl/1.2.5/axiom-impl-1.2.5.jar
[INFO] 
[INFO] Downloading: http://snapshots.repository.codehaus.org/org/apache/geronimo/testsupport/testsupport-common/2.1.8-SNAPSHOT/testsupport-common-2.1.8-SNAPSHOT.jar
[INFO] [INFO] Unable to find resource 'org.apache.ws.commons.axiom:axiom-impl:jar:1.2.5' in
repository apache-incubating (http://people.apache.org/repo/m2-incubating-repository)
[INFO] Downloading: http://repo1.maven.org/eclipse/org/apache/ws/commons/axiom/axiom-impl/1.2.5/axiom-impl-1.2.5.jar
[INFO] [INFO] Unable to find resource 'org.apache.geronimo.testsupport:testsupport-common:jar:2.1.8-SNAPSHOT'
in repository codehaus.snapshots (http://snapshots.repository.codehaus.org)
[INFO] Downloading: http://repository.apache.org/snapshots/org/apache/geronimo/testsupport/testsupport-common/2.1.8-SNAPSHOT/testsupport-common-2.1.8-SNAPSHOT.jar
[INFO] [INFO] Unable to find resource 'org.apache.geronimo.testsupport:testsupport-common:jar:2.1.8-SNAPSHOT'
in repository apache.snapshots (http://repository.apache.org/snapshots)
[INFO] Downloading: http://nexus.openqa.org/content/repositories/snapshots/org/apache/geronimo/testsupport/testsupport-common/2.1.8-SNAPSHOT/testsupport-common-2.1.8-SNAPSHOT.jar
[INFO] [INFO] Unable to find resource 'org.apache.geronimo.testsupport:testsupport-common:jar:2.1.8-SNAPSHOT'
in repository openqa-snapshots (http://nexus.openqa.org/content/repositories/snapshots)
[INFO] Downloading: http://nexus.openqa.org/content/repositories/releases/org/apache/geronimo/specs/geronimo-stax-api_1.0_spec/1.0.1/geronimo-stax-api_1.0_spec-1.0.1.jar
[INFO] [INFO] Unable to find resource 'org.apache.ws.commons.axiom:axiom-impl:jar:1.2.5' in
repository eclipse-repo (http://repo1.maven.org/eclipse)
[INFO] Downloading: http://jibx.sourceforge.net/maven/org.apache.ws.commons.axiom/jars/axiom-impl-1.2.5.jar
[INFO] [INFO] Unable to find resource 'org.apache.geronimo.specs:geronimo-stax-api_1.0_spec:jar:1.0.1'
in repository openqa-releases (http://nexus.openqa.org/content/repositories/releases)
[INFO] Downloading: http://repo2.maven.org/maven2/org/apache/geronimo/specs/geronimo-stax-api_1.0_spec/1.0.1/geronimo-stax-api_1.0_spec-1.0.1.jar
[INFO] [INFO] Unable to find resource 'org.apache.ws.commons.axiom:axiom-impl:jar:1.2.5' in
repository jibx (http://jibx.sourceforge.net/maven)
[INFO] Downloading: http://download.java.net/maven/1//org.apache.ws.commons.axiom/jars/axiom-impl-1.2.5.jar
[INFO] [INFO] Unable to find resource 'org.apache.ws.commons.axiom:axiom-impl:jar:1.2.5' in
repository java.net (http://download.java.net/maven/1/)
[INFO] Downloading: http://repo2.maven.org/maven2/org/apache/ws/commons/axiom/axiom-impl/1.2.5/axiom-impl-1.2.5.jar
[INFO] 
[INFO] 
[INFO] Downloading: http://ws.zones.apache.org/repository2/org/apache/ws/commons/axiom/axiom-dom/1.2.5/axiom-dom-1.2.5.jar
[INFO] [INFO] Unable to find resource 'org.apache.ws.commons.axiom:axiom-dom:jar:1.2.5' in
repository apache-ws-snapshots2 (http://ws.zones.apache.org/repository2)
[INFO] Downloading: http://tomcat.apache.org/dev/dist/m2-repository/org/apache/ws/commons/axiom/axiom-dom/1.2.5/axiom-dom-1.2.5.jar
[INFO] [INFO] Unable to find resource 'org.apache.ws.commons.axiom:axiom-dom:jar:1.2.5' in
repository tomcat-repository (http://tomcat.apache.org/dev/dist/m2-repository)
[INFO] Downloading: http://people.apache.org/repo/m2-incubating-repository/org/apache/ws/commons/axiom/axiom-dom/1.2.5/axiom-dom-1.2.5.jar
[INFO] [INFO] Unable to find resource 'org.apache.ws.commons.axiom:axiom-dom:jar:1.2.5' in
repository apache-incubating (http://people.apache.org/repo/m2-incubating-repository)
[INFO] Downloading: http://repo1.maven.org/eclipse/org/apache/ws/commons/axiom/axiom-dom/1.2.5/axiom-dom-1.2.5.jar
[INFO] [INFO] Unable to find resource 'org.apache.ws.commons.axiom:axiom-dom:jar:1.2.5' in
repository eclipse-repo (http://repo1.maven.org/eclipse)
[INFO] Downloading: http://jibx.sourceforge.net/maven/org.apache.ws.commons.axiom/jars/axiom-dom-1.2.5.jar
[INFO] [INFO] Unable to find resource 'org.apache.ws.commons.axiom:axiom-dom:jar:1.2.5' in
repository jibx (http://jibx.sourceforge.net/maven)
[INFO] Downloading: http://download.java.net/maven/1//org.apache.ws.commons.axiom/jars/axiom-dom-1.2.5.jar
[INFO] [INFO] Unable to find resource 'org.apache.ws.commons.axiom:axiom-dom:jar:1.2.5' in
repository java.net (http://download.java.net/maven/1/)
[INFO] Downloading: http://repo2.maven.org/maven2/org/apache/ws/commons/axiom/axiom-dom/1.2.5/axiom-dom-1.2.5.jar
[INFO] 
[INFO] 
[INFO] 
[INFO] Downloading: http://ws.zones.apache.org/repository2/xerces/xmlParserAPIs/2.6.2/xmlParserAPIs-2.6.2.jar
[INFO] [INFO] Unable to find resource 'xerces:xmlParserAPIs:jar:2.6.2' in repository apache-ws-snapshots2
(http://ws.zones.apache.org/repository2)
[INFO] Downloading: http://tomcat.apache.org/dev/dist/m2-repository/xerces/xmlParserAPIs/2.6.2/xmlParserAPIs-2.6.2.jar
[INFO] [INFO] Unable to find resource 'xerces:xmlParserAPIs:jar:2.6.2' in repository tomcat-repository
(http://tomcat.apache.org/dev/dist/m2-repository)
[INFO] Downloading: http://people.apache.org/repo/m2-incubating-repository/xerces/xmlParserAPIs/2.6.2/xmlParserAPIs-2.6.2.jar
[INFO] [INFO] Unable to find resource 'xerces:xmlParserAPIs:jar:2.6.2' in repository apache-incubating
(http://people.apache.org/repo/m2-incubating-repository)
[INFO] Downloading: http://repo1.maven.org/eclipse/xerces/xmlParserAPIs/2.6.2/xmlParserAPIs-2.6.2.jar
[INFO] [INFO] Unable to find resource 'xerces:xmlParserAPIs:jar:2.6.2' in repository eclipse-repo
(http://repo1.maven.org/eclipse)
[INFO] Downloading: http://jibx.sourceforge.net/maven/xerces/jars/xmlParserAPIs-2.6.2.jar
[INFO] [INFO] Unable to find resource 'xerces:xmlParserAPIs:jar:2.6.2' in repository jibx
(http://jibx.sourceforge.net/maven)
[INFO] Downloading: http://download.java.net/maven/1//xerces/jars/xmlParserAPIs-2.6.2.jar
[INFO] [INFO] Unable to find resource 'xerces:xmlParserAPIs:jar:2.6.2' in repository java.net
(http://download.java.net/maven/1/)
[INFO] Downloading: http://repo2.maven.org/maven2/xerces/xmlParserAPIs/2.6.2/xmlParserAPIs-2.6.2.jar
[INFO] 
[INFO] 
[INFO] [INFO] ------------------------------------------------------------------------
[INFO] [ERROR] BUILD ERROR
--
[INFO] 	at org.apache.maven.DefaultMaven.doExecute(DefaultMaven.java:328)
[INFO] 	at org.apache.maven.DefaultMaven.execute(DefaultMaven.java:138)
[INFO] 	at org.apache.maven.cli.MavenCli.main(MavenCli.java:362)
[INFO] 	at org.apache.maven.cli.compat.CompatibleMain.main(CompatibleMain.java:60)
[INFO] 	at sun.reflect.NativeMethodAccessorImpl.invoke0(Native Method)
[INFO] 	at sun.reflect.NativeMethodAccessorImpl.invoke(NativeMethodAccessorImpl.java:39)
[INFO] 	at sun.reflect.DelegatingMethodAccessorImpl.invoke(DelegatingMethodAccessorImpl.java:25)
[INFO] 	at java.lang.reflect.Method.invoke(Method.java:592)
[INFO] 	at org.codehaus.classworlds.Launcher.launchEnhanced(Launcher.java:315)
[INFO] 	at org.codehaus.classworlds.Launcher.launch(Launcher.java:255)
[INFO] 	at org.codehaus.classworlds.Launcher.mainWithExitCode(Launcher.java:430)
[INFO] 	at org.codehaus.classworlds.Launcher.main(Launcher.java:375)
[INFO] Caused by: org.apache.maven.artifact.resolver.MultipleArtifactsNotFoundException: Missing:
[INFO] ----------
[INFO] 1) xom:xom:jar:1.0
[INFO] 
[INFO]   Try downloading the file manually from the project website.
[INFO] 
[INFO]   Then, install it using the command: 
[INFO]       mvn install:install-file -DgroupId=xom -DartifactId=xom -Dversion=1.0 -Dpackaging=jar
-Dfile=/path/to/file
[INFO] 
[INFO]   Alternatively, if you host your own repository you can deploy the file there: 
[INFO]       mvn deploy:deploy-file -DgroupId=xom -DartifactId=xom -Dversion=1.0 -Dpackaging=jar
-Dfile=/path/to/file -Durl=[url] -DrepositoryId=[id]
[INFO] 
[INFO]   Path to dependency: 
[INFO]   	1) org.apache.geronimo.testsuite:jaxws-client:jar:2.1.8-SNAPSHOT
[INFO]   	2) org.apache.axis2:axis2-jaxws-api:jar:1.3
[INFO]   	3) jaxen:jaxen:jar:1.1.1
[INFO]   	4) xom:xom:jar:1.0
[INFO] 
[INFO] 2) dom4j:dom4j:jar:1.6.1
[INFO] 
[INFO]   Try downloading the file manually from the project website.
[INFO] 
[INFO]   Then, install it using the command: 
[INFO]       mvn install:install-file -DgroupId=dom4j -DartifactId=dom4j -Dversion=1.6.1 -Dpackaging=jar
-Dfile=/path/to/file
[INFO] 
[INFO]   Alternatively, if you host your own repository you can deploy the file there: 
[INFO]       mvn deploy:deploy-file -DgroupId=dom4j -DartifactId=dom4j -Dversion=1.6.1 -Dpackaging=jar
-Dfile=/path/to/file -Durl=[url] -DrepositoryId=[id]
[INFO] 
[INFO]   Path to dependency: 
[INFO]   	1) org.apache.geronimo.testsuite:jaxws-client:jar:2.1.8-SNAPSHOT
[INFO]   	2) org.apache.axis2:axis2-jaxws-api:jar:1.3
[INFO]   	3) jaxen:jaxen:jar:1.1.1
[INFO]   	4) dom4j:dom4j:jar:1.6.1
[INFO] 
[INFO] 3) org.apache.ws.commons.axiom:axiom-api:jar:1.2.5-20100610
[INFO] 
[INFO]   Try downloading the file manually from the project website.
[INFO] 
[INFO]   Then, install it using the command: 
[INFO]       mvn install:install-file -DgroupId=org.apache.ws.commons.axiom -DartifactId=axiom-api
-Dversion=1.2.5-20100610 -Dpackaging=jar -Dfile=/path/to/file
[INFO] 
[INFO]   Alternatively, if you host your own repository you can deploy the file there: 
[INFO]       mvn deploy:deploy-file -DgroupId=org.apache.ws.commons.axiom -DartifactId=axiom-api
-Dversion=1.2.5-20100610 -Dpackaging=jar -Dfile=/path/to/file -Durl=[url] -DrepositoryId=[id]
[INFO] 
[INFO]   Path to dependency: 
[INFO]   	1) org.apache.geronimo.testsuite:jaxws-client:jar:2.1.8-SNAPSHOT
[INFO]   	2) org.apache.axis2:axis2-jaxws-api:jar:1.3
[INFO]   	3) org.apache.ws.commons.axiom:axiom-api:jar:1.2.5-20100610
[INFO] 
[INFO] 4) org.apache.geronimo.testsupport:testsupport-common:jar:2.1.8-SNAPSHOT
[INFO] 
[INFO]   Try downloading the file manually from the project website.
[INFO] 
[INFO]   Then, install it using the command: 
[INFO]       mvn install:install-file -DgroupId=org.apache.geronimo.testsupport -DartifactId=testsupport-common
-Dversion=2.1.8-SNAPSHOT -Dpackaging=jar -Dfile=/path/to/file
[INFO] 
[INFO]   Alternatively, if you host your own repository you can deploy the file there: 
[INFO]       mvn deploy:deploy-file -DgroupId=org.apache.geronimo.testsupport -DartifactId=testsupport-common
-Dversion=2.1.8-SNAPSHOT -Dpackaging=jar -Dfile=/path/to/file -Durl=[url] -DrepositoryId=[id]
[INFO] 
[INFO]   Path to dependency: 
[INFO]   	1) org.apache.geronimo.testsuite:jaxws-client:jar:2.1.8-SNAPSHOT
[INFO]   	2) org.apache.geronimo.testsupport:testsupport-selenium:jar:2.1.8-SNAPSHOT
[INFO]   	3) org.apache.geronimo.testsupport:testsupport-common:jar:2.1.8-SNAPSHOT
[INFO] 
[INFO] ----------
[INFO] 4 required artifacts are missing.
[INFO] 
[INFO] for artifact: 
[INFO]   org.apache.geronimo.testsuite:jaxws-client:jar:2.1.8-SNAPSHOT
[INFO] 
[INFO] from the specified remote repositories:
[INFO]   codehaus.snapshots (http://snapshots.repository.codehaus.org),
[INFO]   ibiblio.org (http://repo2.maven.org/maven2),
[INFO]   apache.snapshots (http://repository.apache.org/snapshots)
[INFO] 
[INFO] 
[INFO] 	at org.apache.maven.artifact.resolver.DefaultArtifactResolver.resolveTransitively(DefaultArtifactResolver.java:360)
[INFO] 	at org.apache.maven.artifact.resolver.DefaultArtifactResolver.resolveTransitively(DefaultArtifactResolver.java:304)
[INFO] 	at org.apache.maven.plugin.DefaultPluginManager.resolveTransitiveDependencies(DefaultPluginManager.java:1499)
[INFO] 	at org.apache.maven.plugin.DefaultPluginManager.executeMojo(DefaultPluginManager.java:442)
[INFO] 	at org.apache.maven.lifecycle.DefaultLifecycleExecutor.executeGoals(DefaultLifecycleExecutor.java:694)
[INFO] 	... 17 more
[INFO] [INFO] ------------------------------------------------------------------------
[INFO] [INFO] Total time: 49 minutes 26 seconds
[INFO] [INFO] Finished at: Thu May 05 14:48:49 EDT 2011
[INFO] [INFO] Final Memory: 45M/533M
[INFO] [INFO] ------------------------------------------------------------------------
[INFO] ------------------------------------------------------------------------
[ERROR] BUILD ERROR
 
Samples: branches/2.1
=================================
Log: http://people.apache.org/builds/geronimo/server/binaries/2.1/20110505/samples-0200.log
 
Build status: FAILED
 

Mime
View raw message