geronimo-dev mailing list archives

Site index · List index
Message view « Date » · « Thread »
Top « Date » · « Thread »
From ga...@apache.org (Jarek Gawor)
Subject [BUILD] branches/2.1: Failed for Revision: 1095270
Date Wed, 20 Apr 2011 16:32:19 GMT
Geronimo Revision: 1095270 built with tests included
 
See the full build-0200.log file at http://people.apache.org/builds/geronimo/server/binaries/2.1/20110420/build-0200.log
 
 
See the unit test reports at http://people.apache.org/builds/geronimo/server/binaries/2.1/20110420/unit-test-reports
 
[INFO] [enforcer:enforce {execution: default}]
[INFO] [remote-resources:process {execution: default}]
[INFO] [resources:resources {execution: default-resources}]
[INFO] Using 'UTF-8' encoding to copy filtered resources.
[INFO] skip non existing resourceDirectory /home/geronimo/geronimo/2.1/testsupport/test-deployment-j2ee_1.3/test-rar-j2ee_1.3/src/main/resources
[INFO] skip non existing resourceDirectory /home/geronimo/geronimo/2.1/testsupport/test-deployment-j2ee_1.3/test-rar-j2ee_1.3/src/main/filtered-resources
[INFO] Copying 3 resources
[INFO] [compiler:compile {execution: default-compile}]
[INFO] No sources to compile
[INFO] [resources:testResources {execution: default-testResources}]
[INFO] Using 'UTF-8' encoding to copy filtered resources.
[INFO] skip non existing resourceDirectory /home/geronimo/geronimo/2.1/testsupport/test-deployment-j2ee_1.3/test-rar-j2ee_1.3/src/test/resources
[INFO] skip non existing resourceDirectory /home/geronimo/geronimo/2.1/testsupport/test-deployment-j2ee_1.3/test-rar-j2ee_1.3/src/test/filtered-resources
[INFO] Copying 3 resources
[INFO] [compiler:testCompile {execution: default-testCompile}]
[INFO] No sources to compile
[INFO] [surefire:test {execution: default-test}]
[INFO] Surefire report directory: /home/geronimo/geronimo/2.1/testsupport/test-deployment-j2ee_1.3/test-rar-j2ee_1.3/target/surefire-reports

-------------------------------------------------------
 T E S T S
-------------------------------------------------------
There are no tests to run.

Results :

Tests run: 0, Failures: 0, Errors: 0, Skipped: 0

[INFO] [rar:rar {execution: default-rar}]
[INFO] Copy rar resources to /home/geronimo/geronimo/2.1/testsupport/test-deployment-j2ee_1.3/test-rar-j2ee_1.3/target/test-rar-j2ee_1.3-2.1.8-SNAPSHOT
[INFO] Using ra.xml /home/geronimo/geronimo/2.1/testsupport/test-deployment-j2ee_1.3/test-rar-j2ee_1.3/src/main/rar/META-INF/ra.xml
[INFO] Could not find manifest file: /home/geronimo/geronimo/2.1/testsupport/test-deployment-j2ee_1.3/test-rar-j2ee_1.3/src/main/rar/META-INF/MANIFEST.MF
- Generating one
[INFO] Building jar: /home/geronimo/geronimo/2.1/testsupport/test-deployment-j2ee_1.3/test-rar-j2ee_1.3/target/test-rar-j2ee_1.3-2.1.8-SNAPSHOT.rar
[INFO] [ianal:verify-legal-files {execution: default}]
[INFO] Checking legal files in: test-rar-j2ee_1.3-2.1.8-SNAPSHOT.rar
[INFO] [install:install {execution: default-install}]
[INFO] Installing /home/geronimo/geronimo/2.1/testsupport/test-deployment-j2ee_1.3/test-rar-j2ee_1.3/target/test-rar-j2ee_1.3-2.1.8-SNAPSHOT.rar
to /home/geronimo/.m2/repository/org/apache/geronimo/testsupport/test-rar-j2ee_1.3/2.1.8-SNAPSHOT/test-rar-j2ee_1.3-2.1.8-SNAPSHOT.rar
[INFO] ------------------------------------------------------------------------
[INFO] Building Geronimo Test Support, Test Deployment J2EE 1.3 :: EAR
[INFO]    task-segment: [install]
[INFO] ------------------------------------------------------------------------
Downloading: http://maven.rtp.raleigh.ibm.com/nexus-proxy//org/apache/maven/plugins/maven-ear-plugin/2.3/maven-ear-plugin-2.3.jar
47K downloaded  (maven-ear-plugin-2.3.jar)
[WARNING] Unable to get resource 'org.apache.maven.plugins:maven-ear-plugin:maven-plugin:2.3'
from repository central (http://repo1.maven.org/maven2): Error copying temporary file to the
final destination: File /home/geronimo/.m2/repository/org/apache/maven/plugins/maven-ear-plugin/2.3/maven-ear-plugin-2.3.jar.tmp
does not exist
[INFO] [genesis:validate-configuration {execution: default}]
[INFO] [enforcer:enforce {execution: default}]
Downloading: http://maven.rtp.raleigh.ibm.com/nexus-proxy//org/codehaus/plexus/plexus-utils/1.2/plexus-utils-1.2.jar
168K downloaded  (plexus-utils-1.2.jar)
[INFO] ------------------------------------------------------------------------
[ERROR] BUILD ERROR
[INFO] ------------------------------------------------------------------------
[INFO] Error configuring: org.apache.maven.plugins:maven-ear-plugin. Reason: A required class
was missing during mojo configuration: org/codehaus/plexus/util/xml/XMLWriter
[INFO] ------------------------------------------------------------------------
[INFO] Trace
org.apache.maven.lifecycle.LifecycleExecutionException: Error configuring: org.apache.maven.plugins:maven-ear-plugin.
Reason: A required class was missing during mojo configuration: org/codehaus/plexus/util/xml/XMLWriter
	at org.apache.maven.lifecycle.DefaultLifecycleExecutor.executeGoals(DefaultLifecycleExecutor.java:723)
	at org.apache.maven.lifecycle.DefaultLifecycleExecutor.executeGoalWithLifecycle(DefaultLifecycleExecutor.java:556)
	at org.apache.maven.lifecycle.DefaultLifecycleExecutor.executeGoal(DefaultLifecycleExecutor.java:535)
	at org.apache.maven.lifecycle.DefaultLifecycleExecutor.executeGoalAndHandleFailures(DefaultLifecycleExecutor.java:387)
	at org.apache.maven.lifecycle.DefaultLifecycleExecutor.executeTaskSegments(DefaultLifecycleExecutor.java:348)
	at org.apache.maven.lifecycle.DefaultLifecycleExecutor.execute(DefaultLifecycleExecutor.java:180)
	at org.apache.maven.DefaultMaven.doExecute(DefaultMaven.java:328)
	at org.apache.maven.DefaultMaven.execute(DefaultMaven.java:138)
	at org.apache.maven.cli.MavenCli.main(MavenCli.java:362)
	at org.apache.maven.cli.compat.CompatibleMain.main(CompatibleMain.java:60)
	at sun.reflect.NativeMethodAccessorImpl.invoke0(Native Method)
	at sun.reflect.NativeMethodAccessorImpl.invoke(NativeMethodAccessorImpl.java:39)
	at sun.reflect.DelegatingMethodAccessorImpl.invoke(DelegatingMethodAccessorImpl.java:25)
	at java.lang.reflect.Method.invoke(Method.java:592)
	at org.codehaus.classworlds.Launcher.launchEnhanced(Launcher.java:315)
	at org.codehaus.classworlds.Launcher.launch(Launcher.java:255)
	at org.codehaus.classworlds.Launcher.mainWithExitCode(Launcher.java:430)
	at org.codehaus.classworlds.Launcher.main(Launcher.java:375)
Caused by: org.apache.maven.plugin.PluginConfigurationException: Error configuring: org.apache.maven.plugins:maven-ear-plugin.
Reason: A required class was missing during mojo configuration: org/codehaus/plexus/util/xml/XMLWriter
	at org.apache.maven.plugin.DefaultPluginManager.populatePluginFields(DefaultPluginManager.java:1374)
	at org.apache.maven.plugin.DefaultPluginManager.getConfiguredMojo(DefaultPluginManager.java:724)
	at org.apache.maven.plugin.DefaultPluginManager.executeMojo(DefaultPluginManager.java:468)
	at org.apache.maven.lifecycle.DefaultLifecycleExecutor.executeGoals(DefaultLifecycleExecutor.java:694)
	... 17 more
Caused by: java.lang.NoClassDefFoundError: org/codehaus/plexus/util/xml/XMLWriter
	at java.lang.Class.getDeclaredMethods0(Native Method)
	at java.lang.Class.privateGetDeclaredMethods(Class.java:2395)
	at java.lang.Class.privateGetPublicMethods(Class.java:2519)
	at java.lang.Class.getMethods(Class.java:1406)
	at hidden.org.codehaus.plexus.util.ReflectionUtils.getSetter(ReflectionUtils.java:90)
	at org.codehaus.plexus.component.configurator.converters.ComponentValueSetter.initSetter(ComponentValueSetter.java:81)
	at org.codehaus.plexus.component.configurator.converters.ComponentValueSetter.<init>(ComponentValueSetter.java:62)
	at org.codehaus.plexus.component.configurator.converters.composite.ObjectWithFieldsConverter.processConfiguration(ObjectWithFieldsConverter.java:134)
	at org.codehaus.plexus.component.configurator.converters.composite.ObjectWithFieldsConverter.fromConfiguration(ObjectWithFieldsConverter.java:90)
	at org.codehaus.plexus.component.configurator.converters.composite.ArrayConverter.fromConfiguration(ArrayConverter.java:135)
	at org.codehaus.plexus.component.configurator.converters.ComponentValueSetter.configure(ComponentValueSetter.java:247)
	at org.codehaus.plexus.component.configurator.converters.composite.ObjectWithFieldsConverter.processConfiguration(ObjectWithFieldsConverter.java:137)
	at org.codehaus.plexus.component.configurator.BasicComponentConfigurator.configureComponent(BasicComponentConfigurator.java:56)
	at org.apache.maven.plugin.DefaultPluginManager.populatePluginFields(DefaultPluginManager.java:1357)
	... 20 more
[INFO] ------------------------------------------------------------------------
[INFO] Total time: 663 minutes 53 seconds
[INFO] Finished at: Wed Apr 20 13:07:49 EDT 2011
[INFO] Final Memory: 170M/540M
[INFO] ------------------------------------------------------------------------

Mime
View raw message