geronimo-dev mailing list archives

Site index · List index
Message view « Date » · « Thread »
Top « Date » · « Thread »
From ga...@apache.org
Subject [BUILD] trunk: Failed for Revision: 1092218
Date Thu, 14 Apr 2011 19:14:53 GMT
Geronimo Revision: 1092218 built with tests included
 
See the full build-0900.log file at http://people.apache.org/builds/geronimo/server/binaries/trunk/20110414/build-0900.log
 
 
See the unit test reports at http://people.apache.org/builds/geronimo/server/binaries/trunk/20110414/unit-test-reports
 
[INFO] Unable to find resource 'org.apache.openjpa:openjpa:jar:2.0.1' in repository jetty.oss.sonatype.org
(http://oss.sonatype.org/content/groups/jetty-with-staging)
Downloading: http://svn.apache.org/repos/asf/servicemix/m2-repo//org/apache/openjpa/openjpa/2.0.1/openjpa-2.0.1.jar
[INFO] Unable to find resource 'org.apache.servicemix.bundles:org.apache.servicemix.bundles.serp:jar:1.13.1_2'
in repository jetty.oss.sonatype.org (http://oss.sonatype.org/content/groups/jetty-with-staging)
Downloading: http://svn.apache.org/repos/asf/servicemix/m2-repo//org/apache/servicemix/bundles/org.apache.servicemix.bundles.serp/1.13.1_2/org.apache.servicemix.bundles.serp-1.13.1_2.jar
[INFO] Unable to find resource 'commons-pool:commons-pool:jar:1.5.4' in repository smx.svn
(http://svn.apache.org/repos/asf/servicemix/m2-repo/)
Downloading: http://download.java.net/maven/2//commons-pool/commons-pool/1.5.4/commons-pool-1.5.4.jar
[INFO] Unable to find resource 'org.apache.openjpa:openjpa:jar:2.0.1' in repository smx.svn
(http://svn.apache.org/repos/asf/servicemix/m2-repo/)
Downloading: http://download.java.net/maven/2//org/apache/openjpa/openjpa/2.0.1/openjpa-2.0.1.jar
[INFO] Unable to find resource 'org.apache.servicemix.bundles:org.apache.servicemix.bundles.serp:jar:1.13.1_2'
in repository smx.svn (http://svn.apache.org/repos/asf/servicemix/m2-repo/)
Downloading: http://download.java.net/maven/2//org/apache/servicemix/bundles/org.apache.servicemix.bundles.serp/1.13.1_2/org.apache.servicemix.bundles.serp-1.13.1_2.jar
[INFO] Unable to find resource 'commons-pool:commons-pool:jar:1.5.4' in repository java.net2
(http://download.java.net/maven/2/)
Downloading: http://nexus.openqa.org/content/repositories/releases/commons-pool/commons-pool/1.5.4/commons-pool-1.5.4.jar
[INFO] Unable to find resource 'org.apache.openjpa:openjpa:jar:2.0.1' in repository java.net2
(http://download.java.net/maven/2/)
Downloading: http://nexus.openqa.org/content/repositories/releases/org/apache/openjpa/openjpa/2.0.1/openjpa-2.0.1.jar
[INFO] Unable to find resource 'org.apache.servicemix.bundles:org.apache.servicemix.bundles.serp:jar:1.13.1_2'
in repository java.net2 (http://download.java.net/maven/2/)
Downloading: http://nexus.openqa.org/content/repositories/releases/org/apache/servicemix/bundles/org.apache.servicemix.bundles.serp/1.13.1_2/org.apache.servicemix.bundles.serp-1.13.1_2.jar
[INFO] Unable to find resource 'commons-pool:commons-pool:jar:1.5.4' in repository openqa-releases
(http://nexus.openqa.org/content/repositories/releases)
[INFO] Unable to find resource 'org.apache.openjpa:openjpa:jar:2.0.1' in repository openqa-releases
(http://nexus.openqa.org/content/repositories/releases)
Downloading: http://repo2.maven.org/maven2/commons-pool/commons-pool/1.5.4/commons-pool-1.5.4.jar
Downloading: http://repo2.maven.org/maven2/org/apache/openjpa/openjpa/2.0.1/openjpa-2.0.1.jar
[INFO] Unable to find resource 'org.apache.servicemix.bundles:org.apache.servicemix.bundles.serp:jar:1.13.1_2'
in repository openqa-releases (http://nexus.openqa.org/content/repositories/releases)
Downloading: http://repo2.maven.org/maven2/org/apache/servicemix/bundles/org.apache.servicemix.bundles.serp/1.13.1_2/org.apache.servicemix.bundles.serp-1.13.1_2.jar



[INFO] [enforcer:enforce {execution: default}]
[INFO] [remote-resources:process {execution: default}]
[INFO] [resources:resources {execution: default-resources}]
[INFO] Using 'UTF-8' encoding to copy filtered resources.
[INFO] skip non existing resourceDirectory /home/geronimo/geronimo/trunk/plugins/openjpa2/geronimo-persistence-jpa20/src/main/resources
[INFO] skip non existing resourceDirectory /home/geronimo/geronimo/trunk/plugins/openjpa2/geronimo-persistence-jpa20/src/main/filtered-resources
[INFO] Copying 3 resources
[INFO] [compiler:compile {execution: default-compile}]
[INFO] Compiling 11 source files to /home/geronimo/geronimo/trunk/plugins/openjpa2/geronimo-persistence-jpa20/target/classes
[INFO] [resources:testResources {execution: default-testResources}]
[INFO] Using 'UTF-8' encoding to copy filtered resources.
[INFO] skip non existing resourceDirectory /home/geronimo/geronimo/trunk/plugins/openjpa2/geronimo-persistence-jpa20/src/test/resources
[INFO] skip non existing resourceDirectory /home/geronimo/geronimo/trunk/plugins/openjpa2/geronimo-persistence-jpa20/src/test/filtered-resources
[INFO] Copying 3 resources
[INFO] [compiler:testCompile {execution: default-testCompile}]
[INFO] Compiling 4 source files to /home/geronimo/geronimo/trunk/plugins/openjpa2/geronimo-persistence-jpa20/target/test-classes
[INFO] [surefire:test {execution: default-test}]
[INFO] Surefire report directory: /home/geronimo/geronimo/trunk/plugins/openjpa2/geronimo-persistence-jpa20/target/surefire-reports

-------------------------------------------------------
 T E S T S
-------------------------------------------------------
Running org.apache.geronimo.persistence.CMPEntityManagerTest
Tests run: 9, Failures: 0, Errors: 0, Skipped: 0, Time elapsed: 0.145 sec
Running org.apache.geronimo.persistence.PersistenceUnitGBeanTest
Tests run: 1, Failures: 1, Errors: 0, Skipped: 0, Time elapsed: 1.442 sec <<< FAILURE!

Results :

Failed tests: 
  testNonNullJavaFileUrls(org.apache.geronimo.persistence.PersistenceUnitGBeanTest)

Tests run: 10, Failures: 1, Errors: 0, Skipped: 0

[INFO] ------------------------------------------------------------------------
[ERROR] BUILD FAILURE
[INFO] ------------------------------------------------------------------------
[INFO] There are test failures.

Please refer to /home/geronimo/geronimo/trunk/plugins/openjpa2/geronimo-persistence-jpa20/target/surefire-reports
for the individual test results.
[INFO] ------------------------------------------------------------------------
[INFO] Trace
org.apache.maven.BuildFailureException: There are test failures.

Please refer to /home/geronimo/geronimo/trunk/plugins/openjpa2/geronimo-persistence-jpa20/target/surefire-reports
for the individual test results.
	at org.apache.maven.lifecycle.DefaultLifecycleExecutor.executeGoals(DefaultLifecycleExecutor.java:715)
	at org.apache.maven.lifecycle.DefaultLifecycleExecutor.executeGoalWithLifecycle(DefaultLifecycleExecutor.java:556)
	at org.apache.maven.lifecycle.DefaultLifecycleExecutor.executeGoal(DefaultLifecycleExecutor.java:535)
	at org.apache.maven.lifecycle.DefaultLifecycleExecutor.executeGoalAndHandleFailures(DefaultLifecycleExecutor.java:387)
	at org.apache.maven.lifecycle.DefaultLifecycleExecutor.executeTaskSegments(DefaultLifecycleExecutor.java:348)
	at org.apache.maven.lifecycle.DefaultLifecycleExecutor.execute(DefaultLifecycleExecutor.java:180)
	at org.apache.maven.DefaultMaven.doExecute(DefaultMaven.java:328)
	at org.apache.maven.DefaultMaven.execute(DefaultMaven.java:138)
	at org.apache.maven.cli.MavenCli.main(MavenCli.java:362)
	at org.apache.maven.cli.compat.CompatibleMain.main(CompatibleMain.java:60)
	at sun.reflect.NativeMethodAccessorImpl.invoke0(Native Method)
	at sun.reflect.NativeMethodAccessorImpl.invoke(NativeMethodAccessorImpl.java:39)
	at sun.reflect.DelegatingMethodAccessorImpl.invoke(DelegatingMethodAccessorImpl.java:25)
	at java.lang.reflect.Method.invoke(Method.java:597)
	at org.codehaus.classworlds.Launcher.launchEnhanced(Launcher.java:315)
	at org.codehaus.classworlds.Launcher.launch(Launcher.java:255)
	at org.codehaus.classworlds.Launcher.mainWithExitCode(Launcher.java:430)
	at org.codehaus.classworlds.Launcher.main(Launcher.java:375)
Caused by: org.apache.maven.plugin.MojoFailureException: There are test failures.

Please refer to /home/geronimo/geronimo/trunk/plugins/openjpa2/geronimo-persistence-jpa20/target/surefire-reports
for the individual test results.
	at org.apache.maven.plugin.surefire.SurefirePlugin.execute(SurefirePlugin.java:575)
	at org.apache.maven.plugin.DefaultPluginManager.executeMojo(DefaultPluginManager.java:490)
	at org.apache.maven.lifecycle.DefaultLifecycleExecutor.executeGoals(DefaultLifecycleExecutor.java:694)
	... 17 more
[INFO] ------------------------------------------------------------------------
[INFO] Total time: 356 minutes 32 seconds
[INFO] Finished at: Thu Apr 14 14:57:52 EDT 2011
[INFO] Final Memory: 347M/779M
[INFO] ------------------------------------------------------------------------

Mime
View raw message