geronimo-dev mailing list archives

Site index · List index
Message view « Date » · « Thread »
Top « Date » · « Thread »
From ga...@apache.org
Subject [BUILD] branches/2.1: Failed for Revision: 1091653
Date Wed, 13 Apr 2011 23:33:47 GMT
Geronimo Revision: 1091653 built with tests included
 
See the full build-0200.log file at http://people.apache.org/builds/geronimo/server/binaries/2.1/20110413/build-0200.log
 
 
See the unit test reports at http://people.apache.org/builds/geronimo/server/binaries/2.1/20110413/unit-test-reports
 
Downloading: http://maven.rtp.raleigh.ibm.com/nexus-proxy//commons-jexl/commons-jexl/1.1/commons-jexl-1.1.jar
Downloading: http://maven.rtp.raleigh.ibm.com/nexus-proxy//ognl/ognl/2.6.9/ognl-2.6.9.jar
Downloading: http://maven.rtp.raleigh.ibm.com/nexus-proxy//xpp3/xpp3/1.1.3.4.O/xpp3-1.1.3.4.O.jar
Downloading: http://maven.rtp.raleigh.ibm.com/nexus-proxy//javax/xml/bind/jaxb-api/2.0/jaxb-api-2.0.jar
117K downloaded  (xpp3-1.1.3.4.O.jar)
164K downloaded  (ognl-2.6.9.jar)
71K downloaded  (jaxb-api-2.0.jar)
239K downloaded  (commons-lang-2.3.jar)
129K downloaded  (commons-jexl-1.1.jar)
Downloading: http://maven.rtp.raleigh.ibm.com/nexus-proxy//org/apache/derby/derbyclient/10.5.3.0_1/derbyclient-10.5.3.0_1.jar
Downloading: http://maven.rtp.raleigh.ibm.com/nexus-proxy//org/apache/geronimo/specs/geronimo-j2ee-management_1.1_spec/1.0.1/geronimo-j2ee-management_1.1_spec-1.0.1.jar
19K downloaded  (geronimo-j2ee-management_1.1_spec-1.0.1.jar)
509K downloaded  (derbyclient-10.5.3.0_1.jar)
Downloading: http://maven.rtp.raleigh.ibm.com/nexus-proxy//org/apache/geronimo/specs/geronimo-ejb_3.0_spec/1.0.1/geronimo-ejb_3.0_spec-1.0.1.jar
Downloading: http://maven.rtp.raleigh.ibm.com/nexus-proxy//org/apache/derby/derbynet/10.5.3.0_1/derbynet-10.5.3.0_1.jar
31K downloaded  (geronimo-ejb_3.0_spec-1.0.1.jar)
227K downloaded  (derbynet-10.5.3.0_1.jar)
Downloading: http://maven.rtp.raleigh.ibm.com/nexus-proxy//org/apache/geronimo/specs/geronimo-jacc_1.1_spec/1.0.1/geronimo-jacc_1.1_spec-1.0.1.jar
Downloading: http://maven.rtp.raleigh.ibm.com/nexus-proxy//org/apache/derby/derbytools/10.5.3.0_1/derbytools-10.5.3.0_1.jar
32K downloaded  (geronimo-jacc_1.1_spec-1.0.1.jar)
161K downloaded  (derbytools-10.5.3.0_1.jar)
[INFO] [enforcer:enforce {execution: default}]
[INFO] [remote-resources:process {execution: default}]
Downloading: http://maven.rtp.raleigh.ibm.com/nexus-proxy//org/apache/apache-jar-resource-bundle/1.4/apache-jar-resource-bundle-1.4.jar
12K downloaded  (apache-jar-resource-bundle-1.4.jar)
[INFO] [resources:resources {execution: default-resources}]
[INFO] Using 'UTF-8' encoding to copy filtered resources.
[INFO] skip non existing resourceDirectory /home/geronimo/geronimo/2.1/plugins/derby/geronimo-derby/src/main/resources
[INFO] skip non existing resourceDirectory /home/geronimo/geronimo/2.1/plugins/derby/geronimo-derby/src/main/filtered-resources
[INFO] Copying 3 resources
[INFO] [compiler:compile {execution: default-compile}]
[INFO] Compiling 7 source files to /home/geronimo/geronimo/2.1/plugins/derby/geronimo-derby/target/classes
[INFO] [resources:testResources {execution: default-testResources}]
[INFO] Using 'UTF-8' encoding to copy filtered resources.
[INFO] skip non existing resourceDirectory /home/geronimo/geronimo/2.1/plugins/derby/geronimo-derby/src/test/resources
[INFO] skip non existing resourceDirectory /home/geronimo/geronimo/2.1/plugins/derby/geronimo-derby/src/test/filtered-resources
[INFO] Copying 3 resources
[INFO] [compiler:testCompile {execution: default-testCompile}]
[INFO] Compiling 2 source files to /home/geronimo/geronimo/2.1/plugins/derby/geronimo-derby/target/test-classes
[WARNING] /home/geronimo/geronimo/2.1/plugins/derby/geronimo-derby/src/test/java/org/apache/geronimo/derby/MockKernel.java:[487,18]
[deprecation] invoke(javax.management.ObjectName,java.lang.String,java.lang.Object[],java.lang.String[])
in org.apache.geronimo.kernel.Kernel has been deprecated

[WARNING] /home/geronimo/geronimo/2.1/plugins/derby/geronimo-derby/src/test/java/org/apache/geronimo/derby/MockKernel.java:[478,18]
[deprecation] invoke(javax.management.ObjectName,java.lang.String) in org.apache.geronimo.kernel.Kernel
has been deprecated

[WARNING] /home/geronimo/geronimo/2.1/plugins/derby/geronimo-derby/src/test/java/org/apache/geronimo/derby/MockKernel.java:[113,18]
[deprecation] getAttribute(javax.management.ObjectName,java.lang.String) in org.apache.geronimo.kernel.Kernel
has been deprecated

[WARNING] /home/geronimo/geronimo/2.1/plugins/derby/geronimo-derby/src/test/java/org/apache/geronimo/derby/MockKernel.java:[584,15]
[deprecation] listGBeans(javax.management.ObjectName) in org.apache.geronimo.kernel.Kernel
has been deprecated

[WARNING] /home/geronimo/geronimo/2.1/plugins/derby/geronimo-derby/src/test/java/org/apache/geronimo/derby/MockKernel.java:[278,21]
[deprecation] getGBeanInfo(javax.management.ObjectName) in org.apache.geronimo.kernel.Kernel
has been deprecated

[WARNING] /home/geronimo/geronimo/2.1/plugins/derby/geronimo-derby/src/test/java/org/apache/geronimo/derby/MockKernel.java:[350,15]
[deprecation] getGBeanState(javax.management.ObjectName) in org.apache.geronimo.kernel.Kernel
has been deprecated

[WARNING] /home/geronimo/geronimo/2.1/plugins/derby/geronimo-derby/src/test/java/org/apache/geronimo/derby/MockKernel.java:[205,18]
[deprecation] getGBean(javax.management.ObjectName) in org.apache.geronimo.kernel.Kernel has
been deprecated

[INFO] [surefire:test {execution: default-test}]
Downloading: http://maven.rtp.raleigh.ibm.com/nexus-proxy//org/apache/maven/surefire/surefire-api/2.4.3/surefire-api-2.4.3.jar
503K downloaded  (surefire-api-2.4.3.jar)
Downloading: http://maven.rtp.raleigh.ibm.com/nexus-proxy//org/apache/maven/surefire/surefire-junit/2.4.3/surefire-junit-2.4.3.jar
14K downloaded  (surefire-junit-2.4.3.jar)
[INFO] Surefire report directory: /home/geronimo/geronimo/2.1/plugins/derby/geronimo-derby/target/surefire-reports
[INFO] ------------------------------------------------------------------------
[ERROR] BUILD FAILURE
[INFO] ------------------------------------------------------------------------
[INFO] There are test failures.

Please refer to /home/geronimo/geronimo/2.1/plugins/derby/geronimo-derby/target/surefire-reports
for the individual test results.
[INFO] ------------------------------------------------------------------------
[INFO] Trace
org.apache.maven.BuildFailureException: There are test failures.

Please refer to /home/geronimo/geronimo/2.1/plugins/derby/geronimo-derby/target/surefire-reports
for the individual test results.
	at org.apache.maven.lifecycle.DefaultLifecycleExecutor.executeGoals(DefaultLifecycleExecutor.java:715)
	at org.apache.maven.lifecycle.DefaultLifecycleExecutor.executeGoalWithLifecycle(DefaultLifecycleExecutor.java:556)
	at org.apache.maven.lifecycle.DefaultLifecycleExecutor.executeGoal(DefaultLifecycleExecutor.java:535)
	at org.apache.maven.lifecycle.DefaultLifecycleExecutor.executeGoalAndHandleFailures(DefaultLifecycleExecutor.java:387)
	at org.apache.maven.lifecycle.DefaultLifecycleExecutor.executeTaskSegments(DefaultLifecycleExecutor.java:348)
	at org.apache.maven.lifecycle.DefaultLifecycleExecutor.execute(DefaultLifecycleExecutor.java:180)
	at org.apache.maven.DefaultMaven.doExecute(DefaultMaven.java:328)
	at org.apache.maven.DefaultMaven.execute(DefaultMaven.java:138)
	at org.apache.maven.cli.MavenCli.main(MavenCli.java:362)
	at org.apache.maven.cli.compat.CompatibleMain.main(CompatibleMain.java:60)
	at sun.reflect.NativeMethodAccessorImpl.invoke0(Native Method)
	at sun.reflect.NativeMethodAccessorImpl.invoke(NativeMethodAccessorImpl.java:39)
	at sun.reflect.DelegatingMethodAccessorImpl.invoke(DelegatingMethodAccessorImpl.java:25)
	at java.lang.reflect.Method.invoke(Method.java:592)
	at org.codehaus.classworlds.Launcher.launchEnhanced(Launcher.java:315)
	at org.codehaus.classworlds.Launcher.launch(Launcher.java:255)
	at org.codehaus.classworlds.Launcher.mainWithExitCode(Launcher.java:430)
	at org.codehaus.classworlds.Launcher.main(Launcher.java:375)
Caused by: org.apache.maven.plugin.MojoFailureException: There are test failures.

Please refer to /home/geronimo/geronimo/2.1/plugins/derby/geronimo-derby/target/surefire-reports
for the individual test results.
	at org.apache.maven.plugin.surefire.SurefirePlugin.execute(SurefirePlugin.java:575)
	at org.apache.maven.plugin.DefaultPluginManager.executeMojo(DefaultPluginManager.java:490)
	at org.apache.maven.lifecycle.DefaultLifecycleExecutor.executeGoals(DefaultLifecycleExecutor.java:694)
	... 17 more
[INFO] ------------------------------------------------------------------------
[INFO] Total time: 355 minutes 22 seconds
[INFO] Finished at: Wed Apr 13 20:07:57 EDT 2011
[INFO] Final Memory: 190M/524M
[INFO] ------------------------------------------------------------------------

Mime
View raw message