geronimo-dev mailing list archives

Site index · List index
Message view « Date » · « Thread »
Top « Date » · « Thread »
From ga...@apache.org
Subject [BUILD] trunk: Failed for Revision: 1091675
Date Wed, 13 Apr 2011 11:07:25 GMT
Geronimo Revision: 1091675 built with tests included
 
See the full build-0300.log file at http://people.apache.org/builds/geronimo/server/binaries/trunk/20110413/build-0300.log
 
 
See the unit test reports at http://people.apache.org/builds/geronimo/server/binaries/trunk/20110413/unit-test-reports
 
    [mkdir] Created dir: /home/geronimo/geronimo/trunk/plugins/connector-1_6/geronimo-connector-builder-1_6/target/test-rar-15-notx/META-INF
     [copy] Copying 2 files to /home/geronimo/geronimo/trunk/plugins/connector-1_6/geronimo-connector-builder-1_6/target/test-rar-15-notx/META-INF
      [jar] Building jar: /home/geronimo/geronimo/trunk/plugins/connector-1_6/geronimo-connector-builder-1_6/target/test-rar-15-notx.rar
    [mkdir] Created dir: /home/geronimo/geronimo/trunk/plugins/connector-1_6/geronimo-connector-builder-1_6/target/test-rar-15-localtx/META-INF
     [copy] Copying 2 files to /home/geronimo/geronimo/trunk/plugins/connector-1_6/geronimo-connector-builder-1_6/target/test-rar-15-localtx/META-INF
      [jar] Building jar: /home/geronimo/geronimo/trunk/plugins/connector-1_6/geronimo-connector-builder-1_6/target/test-rar-15-localtx.rar
      [jar] Building jar: /home/geronimo/geronimo/trunk/plugins/connector-1_6/geronimo-connector-builder-1_6/target/test-ear.ear
    [mkdir] Created dir: /home/geronimo/geronimo/trunk/plugins/connector-1_6/geronimo-connector-builder-1_6/target/test-rar-10-noger/META-INF
     [copy] Copying 1 file to /home/geronimo/geronimo/trunk/plugins/connector-1_6/geronimo-connector-builder-1_6/target/test-rar-10-noger/META-INF
      [jar] Building jar: /home/geronimo/geronimo/trunk/plugins/connector-1_6/geronimo-connector-builder-1_6/target/test-rar-10-noger.rar
    [mkdir] Created dir: /home/geronimo/geronimo/trunk/plugins/connector-1_6/geronimo-connector-builder-1_6/target/test-rar-15-noger/META-INF
     [copy] Copying 1 file to /home/geronimo/geronimo/trunk/plugins/connector-1_6/geronimo-connector-builder-1_6/target/test-rar-15-noger/META-INF
      [jar] Building jar: /home/geronimo/geronimo/trunk/plugins/connector-1_6/geronimo-connector-builder-1_6/target/test-rar-15-noger.rar
      [jar] Building jar: /home/geronimo/geronimo/trunk/plugins/connector-1_6/geronimo-connector-builder-1_6/target/test-ear-noger.ear
    [mkdir] Created dir: /home/geronimo/geronimo/trunk/plugins/connector-1_6/geronimo-connector-builder-1_6/target/test-cf-validation/META-INF
     [copy] Copying 2 files to /home/geronimo/geronimo/trunk/plugins/connector-1_6/geronimo-connector-builder-1_6/target/test-cf-validation/META-INF
      [jar] Building jar: /home/geronimo/geronimo/trunk/plugins/connector-1_6/geronimo-connector-builder-1_6/target/test-cf-validation.rar
    [mkdir] Created dir: /home/geronimo/geronimo/trunk/plugins/connector-1_6/geronimo-connector-builder-1_6/target/test-ra-validation/META-INF
     [copy] Copying 2 files to /home/geronimo/geronimo/trunk/plugins/connector-1_6/geronimo-connector-builder-1_6/target/test-ra-validation/META-INF
      [jar] Building jar: /home/geronimo/geronimo/trunk/plugins/connector-1_6/geronimo-connector-builder-1_6/target/test-ra-validation.rar
    [mkdir] Created dir: /home/geronimo/geronimo/trunk/plugins/connector-1_6/geronimo-connector-builder-1_6/target/test-ao-validation/META-INF
     [copy] Copying 2 files to /home/geronimo/geronimo/trunk/plugins/connector-1_6/geronimo-connector-builder-1_6/target/test-ao-validation/META-INF
      [jar] Building jar: /home/geronimo/geronimo/trunk/plugins/connector-1_6/geronimo-connector-builder-1_6/target/test-ao-validation.rar
    [mkdir] Created dir: /home/geronimo/geronimo/trunk/plugins/connector-1_6/geronimo-connector-builder-1_6/target/test-asb-validation/META-INF
     [copy] Copying 2 files to /home/geronimo/geronimo/trunk/plugins/connector-1_6/geronimo-connector-builder-1_6/target/test-asb-validation/META-INF
      [jar] Building jar: /home/geronimo/geronimo/trunk/plugins/connector-1_6/geronimo-connector-builder-1_6/target/test-asb-validation.rar
[INFO] Executed tasks
[INFO] [compiler:testCompile {execution: default-testCompile}]
[INFO] Compiling 23 source files to /home/geronimo/geronimo/trunk/plugins/connector-1_6/geronimo-connector-builder-1_6/target/test-classes
[WARNING] /home/geronimo/geronimo/trunk/plugins/connector-1_6/geronimo-connector-builder-1_6/src/test/java/org/apache/geronimo/connector/deployment/MockRARDeployable.java:[67,22]
[deprecation] getModuleDTDVersion() in javax.enterprise.deploy.model.DeployableObject has
been deprecated

[INFO] [surefire:test {execution: default-test}]
[INFO] Surefire report directory: /home/geronimo/geronimo/trunk/plugins/connector-1_6/geronimo-connector-builder-1_6/target/surefire-reports

-------------------------------------------------------
 T E S T S
-------------------------------------------------------
Running org.apache.geronimo.connector.deployment.RAR_1_5DConfigBeanTest
Tests run: 1, Failures: 0, Errors: 0, Skipped: 0, Time elapsed: 0.048 sec
Running org.apache.geronimo.connector.deployment.ConnectorModuleBuilderTest
Tests run: 15, Failures: 0, Errors: 0, Skipped: 0, Time elapsed: 7.551 sec
Running org.apache.geronimo.connector.deployment.RAR_1_0DConfigBeanTest
Tests run: 1, Failures: 0, Errors: 0, Skipped: 0, Time elapsed: 0.004 sec
Running org.apache.geronimo.connector.deployment.MessageDestinationTest
Tests run: 3, Failures: 0, Errors: 0, Skipped: 0, Time elapsed: 0.472 sec
Running org.apache.geronimo.connector.deployment.PlanParsingTest
Tests run: 6, Failures: 0, Errors: 0, Skipped: 0, Time elapsed: 0.11 sec
Running org.apache.geronimo.connector.deployment.annotation.AnnotationHelperTest
Tests run: 1, Failures: 1, Errors: 0, Skipped: 0, Time elapsed: 0.032 sec <<< FAILURE!
Running org.apache.geronimo.connector.deployment.SchemaConversionTest
Tests run: 1, Failures: 0, Errors: 0, Skipped: 0, Time elapsed: 0.003 sec

Results :

Failed tests: 
  testResourceAnnotationHelper(org.apache.geronimo.connector.deployment.annotation.AnnotationHelperTest)

Tests run: 28, Failures: 1, Errors: 0, Skipped: 0

[INFO] ------------------------------------------------------------------------
[ERROR] BUILD FAILURE
[INFO] ------------------------------------------------------------------------
[INFO] There are test failures.

Please refer to /home/geronimo/geronimo/trunk/plugins/connector-1_6/geronimo-connector-builder-1_6/target/surefire-reports
for the individual test results.
[INFO] ------------------------------------------------------------------------
[INFO] Trace
org.apache.maven.BuildFailureException: There are test failures.

Please refer to /home/geronimo/geronimo/trunk/plugins/connector-1_6/geronimo-connector-builder-1_6/target/surefire-reports
for the individual test results.
	at org.apache.maven.lifecycle.DefaultLifecycleExecutor.executeGoals(DefaultLifecycleExecutor.java:715)
	at org.apache.maven.lifecycle.DefaultLifecycleExecutor.executeGoalWithLifecycle(DefaultLifecycleExecutor.java:556)
	at org.apache.maven.lifecycle.DefaultLifecycleExecutor.executeGoal(DefaultLifecycleExecutor.java:535)
	at org.apache.maven.lifecycle.DefaultLifecycleExecutor.executeGoalAndHandleFailures(DefaultLifecycleExecutor.java:387)
	at org.apache.maven.lifecycle.DefaultLifecycleExecutor.executeTaskSegments(DefaultLifecycleExecutor.java:348)
	at org.apache.maven.lifecycle.DefaultLifecycleExecutor.execute(DefaultLifecycleExecutor.java:180)
	at org.apache.maven.DefaultMaven.doExecute(DefaultMaven.java:328)
	at org.apache.maven.DefaultMaven.execute(DefaultMaven.java:138)
	at org.apache.maven.cli.MavenCli.main(MavenCli.java:362)
	at org.apache.maven.cli.compat.CompatibleMain.main(CompatibleMain.java:60)
	at sun.reflect.NativeMethodAccessorImpl.invoke0(Native Method)
	at sun.reflect.NativeMethodAccessorImpl.invoke(NativeMethodAccessorImpl.java:39)
	at sun.reflect.DelegatingMethodAccessorImpl.invoke(DelegatingMethodAccessorImpl.java:25)
	at java.lang.reflect.Method.invoke(Method.java:597)
	at org.codehaus.classworlds.Launcher.launchEnhanced(Launcher.java:315)
	at org.codehaus.classworlds.Launcher.launch(Launcher.java:255)
	at org.codehaus.classworlds.Launcher.mainWithExitCode(Launcher.java:430)
	at org.codehaus.classworlds.Launcher.main(Launcher.java:375)
Caused by: org.apache.maven.plugin.MojoFailureException: There are test failures.

Please refer to /home/geronimo/geronimo/trunk/plugins/connector-1_6/geronimo-connector-builder-1_6/target/surefire-reports
for the individual test results.
	at org.apache.maven.plugin.surefire.SurefirePlugin.execute(SurefirePlugin.java:575)
	at org.apache.maven.plugin.DefaultPluginManager.executeMojo(DefaultPluginManager.java:490)
	at org.apache.maven.lifecycle.DefaultLifecycleExecutor.executeGoals(DefaultLifecycleExecutor.java:694)
	... 17 more
[INFO] ------------------------------------------------------------------------
[INFO] Total time: 229 minutes 29 seconds
[INFO] Finished at: Wed Apr 13 06:50:49 EDT 2011
[INFO] Final Memory: 310M/693M
[INFO] ------------------------------------------------------------------------

Mime
View raw message