geronimo-dev mailing list archives

Site index · List index
Message view « Date » · « Thread »
Top « Date » · « Thread »
From ga...@apache.org
Subject [BUILD] branches/2.1: Failed for Revision: 1091297
Date Tue, 12 Apr 2011 11:29:08 GMT
Geronimo Revision: 1091297 built with tests included
 
See the full build-0200.log file at http://people.apache.org/builds/geronimo/server/binaries/2.1/20110412/build-0200.log
 
 
See the unit test reports at http://people.apache.org/builds/geronimo/server/binaries/2.1/20110412/unit-test-reports
 
[INFO] [enforcer:enforce {execution: default}]
[INFO] [remote-resources:process {execution: default}]
[INFO] [resources:resources {execution: default-resources}]
[INFO] Using 'UTF-8' encoding to copy filtered resources.
[INFO] skip non existing resourceDirectory /home/geronimo/geronimo/2.1/testsupport/test-deployment-j2ee_1.3/test-war-j2ee_1.3/src/main/resources
[INFO] skip non existing resourceDirectory /home/geronimo/geronimo/2.1/testsupport/test-deployment-j2ee_1.3/test-war-j2ee_1.3/src/main/filtered-resources
[INFO] Copying 3 resources
[INFO] [compiler:compile {execution: default-compile}]
[INFO] No sources to compile
[INFO] [resources:testResources {execution: default-testResources}]
[INFO] Using 'UTF-8' encoding to copy filtered resources.
[INFO] skip non existing resourceDirectory /home/geronimo/geronimo/2.1/testsupport/test-deployment-j2ee_1.3/test-war-j2ee_1.3/src/test/resources
[INFO] skip non existing resourceDirectory /home/geronimo/geronimo/2.1/testsupport/test-deployment-j2ee_1.3/test-war-j2ee_1.3/src/test/filtered-resources
[INFO] Copying 3 resources
[INFO] [compiler:testCompile {execution: default-testCompile}]
[INFO] No sources to compile
[INFO] [surefire:test {execution: default-test}]
[INFO] Surefire report directory: /home/geronimo/geronimo/2.1/testsupport/test-deployment-j2ee_1.3/test-war-j2ee_1.3/target/surefire-reports

-------------------------------------------------------
 T E S T S
-------------------------------------------------------
There are no tests to run.

Results :

Tests run: 0, Failures: 0, Errors: 0, Skipped: 0

Downloading: http://maven.rtp.raleigh.ibm.com/nexus-proxy//org/apache/maven/maven-plugin-api/2.0.1/maven-plugin-api-2.0.1.pom
643b downloaded  (maven-plugin-api-2.0.1.pom)
[INFO] Unable to find resource 'org.apache.maven:maven-plugin-api:pom:2.0.1' in repository
central (http://repo1.maven.org/maven2)
Downloading: http://maven.rtp.raleigh.ibm.com/nexus-proxy//org/apache/maven/maven-plugin-api/2.0.1/maven-plugin-api-2.0.1.pom
643b downloaded  (maven-plugin-api-2.0.1.pom)
Downloading: http://maven.rtp.raleigh.ibm.com/nexus-proxy//org/apache/maven/maven/2.0.1/maven-2.0.1.pom
11K downloaded  (maven-2.0.1.pom)
Downloading: http://maven.rtp.raleigh.ibm.com/nexus-proxy//org/apache/maven/maven-artifact/2.0.1/maven-artifact-2.0.1.pom
765b downloaded  (maven-artifact-2.0.1.pom)
Downloading: http://maven.rtp.raleigh.ibm.com/nexus-proxy//org/codehaus/plexus/plexus-utils/1.0.4/plexus-utils-1.0.4.jar
Downloading: http://maven.rtp.raleigh.ibm.com/nexus-proxy//org/apache/maven/maven-archiver/2.2/maven-archiver-2.2.jar
9K downloaded  (maven-archiver-2.2.jar)
159K downloaded  (plexus-utils-1.0.4.jar)
Downloading: http://maven.rtp.raleigh.ibm.com/nexus-proxy//org/codehaus/plexus/plexus-archiver/1.0-alpha-7/plexus-archiver-1.0-alpha-7.jar
138K downloaded  (plexus-archiver-1.0-alpha-7.jar)
[INFO] ------------------------------------------------------------------------
[ERROR] BUILD ERROR
[INFO] ------------------------------------------------------------------------
[INFO] Internal error in the plugin manager executing goal 'org.apache.maven.plugins:maven-war-plugin:2.0.2:war':
Error adding plugin dependency 'org.apache.maven:maven-archiver:jar' into plugin manager:
Cannot add jar resource: /home/geronimo/.m2/repository/org/apache/maven/maven-archiver/2.2/maven-archiver-2.2.jar
(error discovering new components)
error in opening zip file
[INFO] ------------------------------------------------------------------------
[INFO] Trace
org.apache.maven.lifecycle.LifecycleExecutionException: Internal error in the plugin manager
executing goal 'org.apache.maven.plugins:maven-war-plugin:2.0.2:war': Error adding plugin
dependency 'org.apache.maven:maven-archiver:jar' into plugin manager: Cannot add jar resource:
/home/geronimo/.m2/repository/org/apache/maven/maven-archiver/2.2/maven-archiver-2.2.jar (error
discovering new components)
	at org.apache.maven.lifecycle.DefaultLifecycleExecutor.executeGoals(DefaultLifecycleExecutor.java:698)
	at org.apache.maven.lifecycle.DefaultLifecycleExecutor.executeGoalWithLifecycle(DefaultLifecycleExecutor.java:556)
	at org.apache.maven.lifecycle.DefaultLifecycleExecutor.executeGoal(DefaultLifecycleExecutor.java:535)
	at org.apache.maven.lifecycle.DefaultLifecycleExecutor.executeGoalAndHandleFailures(DefaultLifecycleExecutor.java:387)
	at org.apache.maven.lifecycle.DefaultLifecycleExecutor.executeTaskSegments(DefaultLifecycleExecutor.java:348)
	at org.apache.maven.lifecycle.DefaultLifecycleExecutor.execute(DefaultLifecycleExecutor.java:180)
	at org.apache.maven.DefaultMaven.doExecute(DefaultMaven.java:328)
	at org.apache.maven.DefaultMaven.execute(DefaultMaven.java:138)
	at org.apache.maven.cli.MavenCli.main(MavenCli.java:362)
	at org.apache.maven.cli.compat.CompatibleMain.main(CompatibleMain.java:60)
	at sun.reflect.NativeMethodAccessorImpl.invoke0(Native Method)
	at sun.reflect.NativeMethodAccessorImpl.invoke(NativeMethodAccessorImpl.java:39)
	at sun.reflect.DelegatingMethodAccessorImpl.invoke(DelegatingMethodAccessorImpl.java:25)
	at java.lang.reflect.Method.invoke(Method.java:592)
	at org.codehaus.classworlds.Launcher.launchEnhanced(Launcher.java:315)
	at org.codehaus.classworlds.Launcher.launch(Launcher.java:255)
	at org.codehaus.classworlds.Launcher.mainWithExitCode(Launcher.java:430)
	at org.codehaus.classworlds.Launcher.main(Launcher.java:375)
Caused by: org.apache.maven.plugin.PluginManagerException: Error adding plugin dependency
'org.apache.maven:maven-archiver:jar' into plugin manager: Cannot add jar resource: /home/geronimo/.m2/repository/org/apache/maven/maven-archiver/2.2/maven-archiver-2.2.jar
(error discovering new components)
	at org.apache.maven.plugin.DefaultPluginManager.ensurePluginContainerIsComplete(DefaultPluginManager.java:857)
	at org.apache.maven.plugin.DefaultPluginManager.getConfiguredMojo(DefaultPluginManager.java:647)
	at org.apache.maven.plugin.DefaultPluginManager.executeMojo(DefaultPluginManager.java:468)
	at org.apache.maven.lifecycle.DefaultLifecycleExecutor.executeGoals(DefaultLifecycleExecutor.java:694)
	... 17 more
Caused by: org.codehaus.plexus.PlexusContainerException: Cannot add jar resource: /home/geronimo/.m2/repository/org/apache/maven/maven-archiver/2.2/maven-archiver-2.2.jar
(error discovering new components)
	at org.codehaus.plexus.DefaultPlexusContainer.addJarResource(DefaultPlexusContainer.java:1405)
	at org.apache.maven.plugin.DefaultPluginManager.ensurePluginContainerIsComplete(DefaultPluginManager.java:853)
	... 20 more
Caused by: org.codehaus.plexus.configuration.PlexusConfigurationException: Error reading configuration
jar:file:/home/geronimo/.m2/repository/org/apache/maven/plugins/maven-war-plugin/2.0.2/maven-war-plugin-2.0.2.jar!/META-INF/maven/plugin.xml
	at org.codehaus.plexus.component.discovery.AbstractComponentDiscoverer.findComponents(AbstractComponentDiscoverer.java:89)
	at org.codehaus.plexus.DefaultPlexusContainer.discoverComponents(DefaultPlexusContainer.java:717)
	at org.codehaus.plexus.DefaultPlexusContainer.addJarResource(DefaultPlexusContainer.java:1396)
	... 21 more
Caused by: java.util.zip.ZipException: error in opening zip file
	at java.util.zip.ZipFile.open(Native Method)
	at java.util.zip.ZipFile.<init>(ZipFile.java:203)
	at java.util.jar.JarFile.<init>(JarFile.java:132)
	at java.util.jar.JarFile.<init>(JarFile.java:70)
	at sun.net.www.protocol.jar.URLJarFile.<init>(URLJarFile.java:56)
	at sun.net.www.protocol.jar.URLJarFile.getJarFile(URLJarFile.java:41)
	at sun.net.www.protocol.jar.JarFileFactory.get(JarFileFactory.java:68)
	at sun.net.www.protocol.jar.JarURLConnection.connect(JarURLConnection.java:102)
	at org.codehaus.plexus.component.discovery.AbstractComponentDiscoverer.findComponents(AbstractComponentDiscoverer.java:72)
	... 23 more
[INFO] ------------------------------------------------------------------------
[INFO] Total time: 359 minutes 51 seconds
[INFO] Finished at: Tue Apr 12 08:03:49 EDT 2011
[INFO] Final Memory: 161M/517M
[INFO] ------------------------------------------------------------------------

Mime
View raw message